{"text_format":"1","workbook":"xlsx","n_sheets":18,"sheets":["Home","Input","Output","Timeline","DATA ","Outcome","soil moisture classes ","GEST 2.0","N2O Fertilizer cattle cropresid","fossil energy","crop use","C content soil","CO2-equivalents","mol masses","Soil Management","grondbew techniek (1)","Watermanagement","crop residue paludi"],"not_rendered":{"charts":4,"images":9,"macros":0,"external_links":0,"defined_names":1,"comments":5,"pivot_tables":0},"unopened":[],"bounds":{"document_bytes":16777216,"sheet_cells":100000,"rows_first":2000,"rows_last":500,"rows_between":2000,"halvings":0,"cell_chars":16384,"cell_head_chars":4096},"cells_cut":0,"cells_raw":0,"read":"whole","date_system":"1900"}

{"sheet":"Home","index":0,"n_rows":64,"n_cols":5,"rows_kept":64,"cut":false,"hidden":false,"merged":[[1,4,1,5],[33,2,37,7],[27,2,30,7],[48,2,49,7]]}
[]
[null,null,"Carbon Connects",null,"Site Emissions Tool (SET)"]
[]
[]
[]
[]
[]
[]
{"$rows_left_out":57}
{"sheet":"Input","index":1,"n_rows":118,"n_cols":10,"rows_kept":118,"cut":false,"hidden":false,"merged":[[25,6,25,10],[1,6,1,8]]}
[]
[null,null,"Carbon Connects",null,null,null,"Site Emissions Tool (SET)"]
[]
[]
[]
[]
[]
[]
{"$rows_left_out":111}
{"sheet":"Output","index":2,"n_rows":134,"n_cols":14,"rows_kept":134,"cut":false,"hidden":false,"merged":[[129,10,133,15],[121,10,123,15],[125,10,127,15],[1,6,1,9],[34,8,34,9],[36,8,36,10],[36,5,36,6]]}
[]
[null,null,"Carbon Connects",null,null,null,"Site Emissions Tool (SET)"]
[]
[]
[]
[]
[]
[]
{"$rows_left_out":127}
{"sheet":"Timeline","index":3,"n_rows":52,"n_cols":25,"rows_kept":52,"cut":false,"hidden":true,"merged":[]}
["_",null,"Baseline","Rewetting",null,null,null,null,null,null,null,null,null,null,null,"C-credits"]
["Year","baseline emission","Baseline_GESTv2","rewetting emission","Rewetting_GESTv2","Carbon savings flow","Carbon savings stock","Carbon savings product","Carbon savings_tot","baseline GESTnr","C-sequestration baseline","C-stock soil (baseline)","Stock savings creditable?","Rewet GESTnr","C-sequestration rewet",{"$f":"CONCATENATE(P1,A1,Input!$G$26)","v":"C-credits_"}]
[{"$f":"Input!G38","v":0},{"$f":"Outcome!$D$10","v":{"$error":"#DIV/0!"}},{"$f":"VLOOKUP('DATA '!$C$43,'DATA '!$B$19:$C$40,2,FALSE)","v":"Choose your vegetation class"},{"$f":"Outcome!$F$10","v":{"$error":"#DIV/0!"}},{"$f":"VLOOKUP('DATA '!$C$71,'DATA '!$B$47:$C$69,2,FALSE)","v":"Choose your vegetation class"},{"$f":"(Outcome!$D$6-Outcome!$F$6)+(Outcome!$D$7-Outcome!$F$7)+(Outcome!$D$9-Outcome!$F$9)","v":{"$error":"#DIV/0!"}},{"$f":"(Outcome!$D$5-Outcome!$F$5)+(Outcome!$D$4-Outcome!$F$4)","v":0},{"$f":"Outcome!$D$8 - Outcome!$F$8","v":0},{"$f":"SUM(F3:H3)","v":{"$error":"#DIV/0!"}},{"$f":"LEFT(C3, FIND(\":\",C3)-1)","v":{"$error":"#VALUE!"}},{"$f":"VLOOKUP(J3,'GEST 2.0'!$A$1:$O$45,15,FALSE)*Input!$G$28*-1","v":{"$error":"#VALUE!"}},{"$f":"'C content soil'!E13*Input!G28+K3","v":{"$error":"#VALUE!"}},{"$f":"IF(L3>0,1,0)","v":{"$error":"#VALUE!"}},{"$f":"LEFT(E3, FIND(\":\",E3)-1)","v":{"$error":"#VALUE!"}},{"$f":"VLOOKUP(N3,'GEST 2.0'!$A$1:$O$45,15,FALSE)*Input!$G$28*-1","v":{"$error":"#VALUE!"}},{"$f":"IF(M3=1,I3,F3+H3+IF(O3>0,O3*44/12,0))","v":{"$error":"#VALUE!"}},null,null,null,null,null,null,null,"ppe","Prijs"]
[{"$f":"A3+1","v":1},{"$f":"Outcome!$D$10","v":{"$error":"#DIV/0!"}},{"$f":"VLOOKUP('DATA '!$C$43,'DATA '!$B$19:$C$40,2,FALSE)","v":"Choose your vegetation class"},{"$f":"Outcome!$F$10","v":{"$error":"#DIV/0!"}},{"$f":"VLOOKUP('DATA '!$C$71,'DATA '!$B$47:$C$69,2,FALSE)","v":"Choose your vegetation class"},{"$f":"(Outcome!$D$6-Outcome!$F$6)+(Outcome!$D$7-Outcome!$F$7)+(Outcome!$D$9-Outcome!$F$9)","v":{"$error":"#DIV/0!"}},{"$f":"(Outcome!$D$5-Outcome!$F$5)+(Outcome!$D$4-Outcome!$F$4)","v":0},{"$f":"Outcome!$D$8 - Outcome!$F$8","v":0},{"$f":"SUM(F4:H4)","v":{"$error":"#DIV/0!"}},{"$error":"#VALUE!"},{"$f":"VLOOKUP(J4,'GEST 2.0'!$A$1:$O$45,15,FALSE)*Input!$G$28*-1","v":{"$error":"#VALUE!"}},{"$f":"L3+K4","v":{"$error":"#VALUE!"}},{"$f":"IF(L4>0,1,0)","v":{"$error":"#VALUE!"}},{"$f":"LEFT(E4, FIND(\":\",E4)-1)","v":{"$error":"#VALUE!"}},{"$f":"VLOOKUP(N4,'GEST 2.0'!$A$1:$O$45,15,FALSE)*Input!$G$28*-1","v":{"$error":"#VALUE!"}},{"$f":"IF(M4=1,I4,F4+H4+IF(O4>0,O4*44/12,0))","v":{"$error":"#VALUE!"}},null,null,null,null,"Total C-credits GEST2",null,{"$f":"SUM(P3:P52)","v":{"$error":"#VALUE!"}},70,{"$f":"X4*W4","v":{"$error":"#VALUE!"}}]
[{"$f":"A4+1","v":2},{"$f":"Outcome!$D$10","v":{"$error":"#DIV/0!"}},{"$f":"VLOOKUP('DATA '!$C$43,'DATA '!$B$19:$C$40,2,FALSE)","v":"Choose your vegetation class"},{"$f":"Outcome!$F$10","v":{"$error":"#DIV/0!"}},{"$f":"VLOOKUP('DATA '!$C$71,'DATA '!$B$47:$C$69,2,FALSE)","v":"Choose your vegetation class"},{"$f":"(Outcome!$D$6-Outcome!$F$6)+(Outcome!$D$7-Outcome!$F$7)+(Outcome!$D$9-Outcome!$F$9)","v":{"$error":"#DIV/0!"}},{"$f":"(Outcome!$D$5-Outcome!$F$5)+(Outcome!$D$4-Outcome!$F$4)","v":0},{"$f":"Outcome!$D$8 - Outcome!$F$8","v":0},{"$error":"#DIV/0!"},{"$error":"#VALUE!"},{"$f":"VLOOKUP(J5,'GEST 2.0'!$A$1:$O$45,15,FALSE)*Input!$G$28*-1","v":{"$error":"#VALUE!"}},{"$f":"L4+K5","v":{"$error":"#VALUE!"}},{"$error":"#VALUE!"},{"$error":"#VALUE!"},{"$f":"VLOOKUP(N5,'GEST 2.0'!$A$1:$O$45,15,FALSE)*Input!$G$28*-1","v":{"$error":"#VALUE!"}},{"$error":"#VALUE!"}]
[3,{"$f":"Outcome!$D$10","v":{"$error":"#DIV/0!"}},{"$f":"VLOOKUP('DATA '!$C$43,'DATA '!$B$19:$C$40,2,FALSE)","v":"Choose your vegetation class"},{"$f":"Outcome!$F$10","v":{"$error":"#DIV/0!"}},{"$f":"VLOOKUP('DATA '!$C$71,'DATA '!$B$47:$C$69,2,FALSE)","v":"Choose your vegetation class"},{"$f":"(Outcome!$D$6-Outcome!$F$6)+(Outcome!$D$7-Outcome!$F$7)+(Outcome!$D$9-Outcome!$F$9)","v":{"$error":"#DIV/0!"}},{"$f":"(Outcome!$D$5-Outcome!$F$5)+(Outcome!$D$4-Outcome!$F$4)","v":0},{"$f":"Outcome!$D$8 - Outcome!$F$8","v":0},{"$error":"#DIV/0!"},{"$error":"#VALUE!"},{"$f":"VLOOKUP(J6,'GEST 2.0'!$A$1:$O$45,15,FALSE)*Input!$G$28*-1","v":{"$error":"#VALUE!"}},{"$error":"#VALUE!"},{"$error":"#VALUE!"},{"$error":"#VALUE!"},{"$f":"VLOOKUP(N6,'GEST 2.0'!$A$1:$O$45,15,FALSE)*Input!$G$28*-1","v":{"$error":"#VALUE!"}},{"$error":"#VALUE!"}]
[4,{"$f":"Outcome!$D$10","v":{"$error":"#DIV/0!"}},{"$f":"VLOOKUP('DATA '!$C$43,'DATA '!$B$19:$C$40,2,FALSE)","v":"Choose your vegetation class"},{"$f":"Outcome!$F$10","v":{"$error":"#DIV/0!"}},{"$f":"VLOOKUP('DATA '!$C$71,'DATA '!$B$47:$C$69,2,FALSE)","v":"Choose your vegetation class"},{"$f":"(Outcome!$D$6-Outcome!$F$6)+(Outcome!$D$7-Outcome!$F$7)+(Outcome!$D$9-Outcome!$F$9)","v":{"$error":"#DIV/0!"}},{"$f":"(Outcome!$D$5-Outcome!$F$5)+(Outcome!$D$4-Outcome!$F$4)","v":0},{"$f":"Outcome!$D$8 - Outcome!$F$8","v":0},{"$error":"#DIV/0!"},{"$error":"#VALUE!"},{"$f":"VLOOKUP(J7,'GEST 2.0'!$A$1:$O$45,15,FALSE)*Input!$G$28*-1","v":{"$error":"#VALUE!"}},{"$error":"#VALUE!"},{"$error":"#VALUE!"},{"$error":"#VALUE!"},{"$f":"VLOOKUP(N7,'GEST 2.0'!$A$1:$O$45,15,FALSE)*Input!$G$28*-1","v":{"$error":"#VALUE!"}},{"$error":"#VALUE!"}]
[5,{"$f":"Outcome!$D$10","v":{"$error":"#DIV/0!"}},{"$f":"VLOOKUP('DATA '!$C$43,'DATA '!$B$19:$C$40,2,FALSE)","v":"Choose your vegetation class"},{"$f":"Outcome!$F$10","v":{"$error":"#DIV/0!"}},{"$f":"VLOOKUP('DATA '!$C$71,'DATA '!$B$47:$C$69,2,FALSE)","v":"Choose your vegetation class"},{"$f":"(Outcome!$D$6-Outcome!$F$6)+(Outcome!$D$7-Outcome!$F$7)+(Outcome!$D$9-Outcome!$F$9)","v":{"$error":"#DIV/0!"}},{"$f":"(Outcome!$D$5-Outcome!$F$5)+(Outcome!$D$4-Outcome!$F$4)","v":0},{"$f":"Outcome!$D$8 - Outcome!$F$8","v":0},{"$error":"#DIV/0!"},{"$error":"#VALUE!"},{"$f":"VLOOKUP(J8,'GEST 2.0'!$A$1:$O$45,15,FALSE)*Input!$G$28*-1","v":{"$error":"#VALUE!"}},{"$error":"#VALUE!"},{"$error":"#VALUE!"},{"$error":"#VALUE!"},{"$f":"VLOOKUP(N8,'GEST 2.0'!$A$1:$O$45,15,FALSE)*Input!$G$28*-1","v":{"$error":"#VALUE!"}},{"$error":"#VALUE!"}]
{"$rows_left_out":45}
{"sheet":"DATA ","index":4,"n_rows":106,"n_cols":13,"rows_kept":106,"cut":false,"hidden":true,"merged":[[16,5,16,6],[16,7,16,8],[44,5,44,6],[44,7,44,8]]}
[]
[null,null,"Soilmoisture"]
[null,1,{"$f":"CONCATENATE('soil moisture classes '!A3,'soil moisture classes '!L3,'soil moisture classes '!B3)","v":"7+Upper sublitoral"}]
[null,2,{"$f":"CONCATENATE('soil moisture classes '!A4,'soil moisture classes '!L4,'soil moisture classes '!B4)","v":"6+Flooded (lower eulittoral)"}]
[null,3,{"$f":"CONCATENATE('soil moisture classes '!A5,'soil moisture classes '!L5,'soil moisture classes '!B5)","v":"5+Wet (upper eulittoral)"}]
[null,4,{"$f":"CONCATENATE('soil moisture classes '!A6,'soil moisture classes '!L6,'soil moisture classes '!B6)","v":"4+Semi wet (very moist)"}]
[null,5,{"$f":"CONCATENATE('soil moisture classes '!A7,'soil moisture classes '!L7,'soil moisture classes '!B7)","v":"3+moist"}]
[null,6,{"$f":"CONCATENATE('soil moisture classes '!A8,'soil moisture classes '!L8,'soil moisture classes '!B8)","v":"2+Moderate moist"}]
{"$rows_left_out":99}
{"sheet":"Outcome","index":5,"n_rows":17,"n_cols":7,"rows_kept":17,"cut":false,"hidden":true,"merged":[]}
[]
[]
[null,null,null,"Baseline",null,"Rewetting"]
[null,null,"CH4",{"$f":"Output!G45","v":0},"CO2-eq",{"$f":"'DATA '!K70*Input!G28","v":0},"CO2-eq"]
[null,null,"CO2",{"$f":"Output!G47","v":0},"CO2-eq",{"$f":"'DATA '!L70*Input!G28","v":0},"CO2-eq"]
[null,null,"N20 direct",{"$f":"'N2O Fertilizer cattle cropresid'!C189","v":{"$error":"#DIV/0!"}},"CO2-eq",{"$f":"'N2O Fertilizer cattle cropresid'!E189","v":{"$error":"#DIV/0!"}},"CO2-eq"]
[null,null,"N20 indirect",{"$f":"'N2O Fertilizer cattle cropresid'!C236","v":{"$error":"#DIV/0!"}},"CO2-eq",{"$f":"'N2O Fertilizer cattle cropresid'!E236","v":{"$error":"#DIV/0!"}},"CO2-eq"]
[null,null,"product",null,null,{"$f":"'crop use'!F21","v":0},"CO2-eq"]
{"$rows_left_out":10}
{"sheet":"soil moisture classes ","index":6,"n_rows":16,"n_cols":13,"rows_kept":16,"cut":false,"hidden":true,"merged":[[0,0,0,1],[0,2,0,3],[1,0,1,1],[0,12,3,12]]}
["Soil moisture class (GEST)",null,"Water tables in relation to surface (+ above, - below)",null,"Relevant classes","winter",null,"zomer",null,"baseline","Rewetting",null,"Soil moisture classes and associated water tables (modified after KOSKA et al. 2001). Soil moisture classes are characterised by: WLw: long-term median water table in the wet season; WLd: long-term median water table in the dry season; and WD: water supply deficit. Seasonally alternating wetness is indicated by a combination of different classes, e.g. 5+/4+ refers to a WLw within 5+ range and a WLd within 4+ range. Strongly alternating wetness is indicated by a tilde-sign, e.g. 3~ refers to a WLw within 4+ range and a WLd within 2+ range."]
[null,null,"WLw","WLd",null,"hoogste ","laagste","hoogste ","laagste","Zomer","Zomer"]
["7+","Upper sublitoral","+250 to +140 cm","+250 to +140 cm"]
["6+","Flooded (lower eulittoral)","+150 to +10 cm","+140 to +0 cm","X",150,10,{"$f":"140.000000000001","v":140.00000000000099},0,{"$f":"IF(AND(Input!$G$43<'soil moisture classes '!H4,Input!$G$43>='soil moisture classes '!I4),'soil moisture classes '!A4,\"\")","v":"6+"},{"$f":"IF(AND(Input!$G$50<'soil moisture classes '!H4,Input!$G$50>='soil moisture classes '!I4),'soil moisture classes '!A4,\"\")","v":"6+"}]
["5+","Wet (upper eulittoral)","+ 10 to – 5 cm","+0 to -10 cm","X",9.9999999899999992,-5,-9.9999999999999998E-13,-10,{"$f":"IF(AND(Input!$G$43<'soil moisture classes '!H5,Input!$G$43>='soil moisture classes '!I5),'soil moisture classes '!A5,\"\")","v":""},{"$f":"IF(AND(Input!$G$50<'soil moisture classes '!H5,Input!$G$50>='soil moisture classes '!I5),'soil moisture classes '!A5,\"\")","v":""}]
["4+","Semi wet (very moist)","-5 -to -15 cm","-10 to -20 cm","X",-5.0000000001,-15,-10.000000001,-20,{"$f":"IF(AND(Input!$G$43<'soil moisture classes '!H6,Input!$G$43>='soil moisture classes '!I6),'soil moisture classes '!A6,\"\")","v":""},{"$f":"IF(AND(Input!$G$50<'soil moisture classes '!H6,Input!$G$50>='soil moisture classes '!I6),'soil moisture classes '!A6,\"\")","v":""}]
["3+","moist","-15 to -35 cm","-20 to -45 cm","X",-15.000000000009999,-35,-20.000000000010001,-45,{"$f":"IF(AND(Input!$G$43<'soil moisture classes '!H7,Input!$G$43>='soil moisture classes '!I7),'soil moisture classes '!A7,\"\")","v":""},{"$f":"IF(AND(Input!$G$50<'soil moisture classes '!H7,Input!$G$50>='soil moisture classes '!I7),'soil moisture classes '!A7,\"\")","v":""},null,"Table from Joosten et al. 2015; who modified after Koska et al. 2001"]
["2+","Moderate moist","-35 to -70 cm","-45 to -85 cm","X",-35.000000000009997,-70,-45.000000000009997,-85,{"$f":"IF(AND(Input!$G$43<'soil moisture classes '!H8,Input!$G$43>='soil moisture classes '!I8),'soil moisture classes '!A8,\"\")","v":""},{"$f":"IF(AND(Input!$G$50<'soil moisture classes '!H8,Input!$G$50>='soil moisture classes '!I8),'soil moisture classes '!A8,\"\")","v":""},null,"Sources:"]
{"$rows_left_out":9}
{"sheet":"GEST 2.0","index":7,"n_rows":91,"n_cols":52,"rows_kept":91,"cut":false,"hidden":true,"merged":[[0,40,0,41],[0,42,0,43],[0,46,0,47],[0,48,0,49],[0,51,5,57],[0,0,1,0],[0,1,1,1],[0,2,1,2],[0,9,0,10],[0,11,0,12],[0,30,0,31],[0,34,0,35],[0,36,0,37],[0,16,0,17],[0,18,0,19],[0,22,0,23],[0,24,0,25],[0,28,0,29]]}
["N°","GEST","Soil Moisture Classes","Summer Moisture classes disaggregate",null,null,null,null,null,"CH4",null,"CO2",null,"Total C-flux","Total C-flux",{"$f":"'soil moisture classes '!J10","v":"6+"},"CH4",null,"CO2",null,"Total C-flux",null,"CH4",null,"CO2",null,"Total C-flux",null,"CH4",null,"CO2",null,"Total C-flux",null,"CH4",null,"CO2",null,"Total C-flux",null,"CH4",null,"CO2",null,"Total C-flux",null,"CH4",null,"CO2",null,"Total C-flux","List of aggregated GESTs as a result of clustering CH4 and CO2 flux measurements (CH4 & CO2 emissions averaged as GWP in t CO2e·ha-1·a-1; bold – measured; italic – estimate of similar GEST; Trend: (+) – higher than, (-) – lower than, (~) – nearly the same as in Couwenberg et al. 2008, 2011, (*) – new GEST)"]
[null,null,null,"6+","5+","4+","3+","2+","2-","GWP","n","GWP","n","GWP","ton C/ha",{"$f":"D2","v":"6+"},"GWP","n","GWP","n","GWP",{"$f":"E2","v":"5+"},"GWP","n","GWP","n","GWP",{"$f":"F2","v":"4+"},"GWP","n","GWP","n","GWP",{"$f":"G2","v":"3+"},"GWP","n","GWP","n","GWP",{"$f":"H2","v":"2+"},"GWP","n","GWP","n","GWP",{"$f":"I2","v":"2-"},"GWP","n","GWP","n","GWP"]
[null,"Grassland"]
["G1","Dry to moderately moist grassland","(2~), 2+, 2- ",null,null,null,null,"2+","2-",-0.01,24,31.44,16,31.5,8.5742454545454549,{"$f":"IF(D4=D$2,CONCATENATE($A4,\":\",\" \",$B4),\"\")","v":""},{"$f":"IF($D4=$D$2,J4,\"\")","v":""},{"$f":"IF($D4=$D$2,K4,\"\")","v":""},{"$f":"IF($D4=$D$2,L4,\"\")","v":""},{"$f":"IF($D4=$D$2,M4,\"\")","v":""},{"$f":"IF($D4=$D$2,N4,\"\")","v":""},{"$f":"IF(E4=E$2,CONCATENATE($A4,\":\",\" \",$B4),\"\")","v":""},{"$f":"IF($E4=$E$2,J4,\"\")","v":""},{"$f":"IF($E4=$E$2,K4,\"\")","v":""},{"$f":"IF($E4=$E$2,L4,\"\")","v":""},{"$f":"IF($E4=$E$2,M4,\"\")","v":""},{"$f":"IF($E4=$E$2,N4,\"\")","v":""},{"$f":"IF(F4=F$2,CONCATENATE($A4,\":\",\" \",$B4),\"\")","v":""},{"$f":"IF($F4=$F$2,J4,\"\")","v":""},{"$f":"IF($F4=$F$2,K4,\"\")","v":""},{"$f":"IF($F4=$F$2,L4,\"\")","v":""},{"$f":"IF($F4=$F$2,M4,\"\")","v":""},{"$f":"IF($F4=$F$2,N4,\"\")","v":""},{"$f":"IF(G4=G$2,CONCATENATE($A4,\":\",\" \",$B4),\"\")","v":""},{"$f":"IF($G4=$G$2,J4,\"\")","v":""},{"$f":"IF($G4=$G$2,K4,\"\")","v":""},{"$f":"IF($G4=$G$2,L4,\"\")","v":""},{"$f":"IF($G4=$G$2,M4,\"\")","v":""},{"$f":"IF($G4=$G$2,N4,\"\")","v":""},{"$f":"IF(H4=H$2,CONCATENATE($A4,\":\",\" \",$B4),\"\")","v":"G1: Dry to moderately moist grassland"},{"$f":"IF($H4=$H$2,J4,\"\")","v":-0.01},{"$f":"IF($H4=$H$2,K4,\"\")","v":24},{"$f":"IF($H4=$H$2,L4,\"\")","v":31.44},{"$f":"IF($H4=$H$2,M4,\"\")","v":16},{"$f":"IF($H4=$H$2,N4,\"\")","v":31.5},{"$f":"IF(I4=I$2,CONCATENATE($A4,\":\",\" \",$B4),\"\")","v":"G1: Dry to moderately moist grassland"},{"$f":"IF($I4=$I$2,J4,\"\")","v":-0.01},{"$f":"IF($I4=$I$2,K4,\"\")","v":24},{"$f":"IF($I4=$I$2,L4,\"\")","v":31.44},{"$f":"IF($I4=$I$2,M4,\"\")","v":16}]
["G2","Moist grassland","3+, 3+/2+",null,null,null,"3+","2+",null,0.01,48,19.37,38,19.5,5.2830272727272733,{"$f":"IF(D5=D$2,CONCATENATE($A5,\":\",\" \",$B5),\"\")","v":""},"","","","","",{"$f":"IF(E5=E$2,CONCATENATE($A5,\":\",\" \",$B5),\"\")","v":""},"","","","","",{"$f":"IF(F5=F$2,CONCATENATE($A5,\":\",\" \",$B5),\"\")","v":""},"","","","","",{"$f":"IF(G5=G$2,CONCATENATE($A5,\":\",\" \",$B5),\"\")","v":"G2: Moist grassland"},0.01,48,19.37,38,19.5,{"$f":"IF(H5=H$2,CONCATENATE($A5,\":\",\" \",$B5),\"\")","v":"G2: Moist grassland"},0.01,48,19.37,38,19.5,{"$f":"IF(I5=I$2,CONCATENATE($A5,\":\",\" \",$B5),\"\")","v":""},"","","",""]
["G3","Moist to very moist grassland","4+/3+",null,null,null,"3+",null,null,0.03,3,13.46,4,13.5,3.671809090909091,"","","","","","","","","","","","","","","","","","","G3: Moist to very moist grassland",0.03,3,13.46,4,13.5,"","","","","","","","","","",""]
["G3f","Periodically flooded grasslands","4~, 3~",null,null,"4+","3+","2+",null,-0.05,3,13.46,"-",13,3.6694090909090908,"","","","","","","","","","","","","G3f: Periodically flooded grasslands",-0.05,3,13.46,"-",13,"G3f: Periodically flooded grasslands",-0.05,3,13.46,"-",13,"G3f: Periodically flooded grasslands",-0.05,3,13.46,"-",13,"","","","",""]
["G3s","Moist to very moist grassland with shunt  species","4+/3+, 3~, (3+, 3+/2+)",null,null,null,"3+","2+",null,0.75,7,13.46,"-",14,3.6934090909090909,"","","","","","","","","","","","","","","","","","","G3s: Moist to very moist grassland with shunt  species",0.75,7,13.46,"-",14,"G3s: Moist to very moist grassland with shunt  species",0.75,7,13.46,"-",14,"","","","","","shunt species here is Juncus"]
{"$rows_left_out":84}
{"sheet":"N2O Fertilizer cattle cropresid","index":8,"n_rows":236,"n_cols":18,"rows_kept":236,"cut":false,"hidden":true,"merged":[[50,10,50,11],[43,14,43,15],[43,16,43,17],[44,14,44,15],[44,10,44,11],[45,10,45,11],[46,10,46,11],[47,10,47,11],[48,10,48,11],[49,10,49,11]]}
[]
[]
[]
[]
[]
[]
[]
[]
{"$rows_left_out":229}
{"sheet":"fossil energy","index":9,"n_rows":20,"n_cols":7,"rows_kept":20,"cut":false,"hidden":true,"merged":[]}
[]
[]
[]
[null,"diesel ",3.35,"kg CO2/liter"]
[null,"electricity",0.58099999999999996,"kg CO2/ kwh"]
[]
[]
[]
{"$rows_left_out":13}
{"sheet":"crop use","index":10,"n_rows":22,"n_cols":7,"rows_kept":22,"cut":false,"hidden":true,"merged":[]}
[]
[null,"Product use ","lifetime longer than 10 year","replace fossil product",{"$f":"Input!G95","v":0}]
[1,"building material e.g. insulation, taching, timber","yes","no",{"$f":"IF(OR(C3=\"yes\",D3=\"yes\"),1,0)","v":1},{"$f":"$E$2*E3","v":0},{"$f":"IF('DATA '!$C$103='crop use'!A3,'crop use'!F3,0)","v":0}]
[2,"bedding material","no","no",{"$f":"IF(OR(C4=\"yes\",D4=\"yes\"),1,0)","v":0},{"$f":"$E$2*E4","v":0},{"$f":"IF('DATA '!$C$103='crop use'!A4,'crop use'!F4,0)","v":0}]
[3,"food application","no","no",0,0,{"$f":"IF('DATA '!$C$103='crop use'!A5,'crop use'!F5,0)","v":0}]
[4,"fodder/ feed application","no","no",0,0,{"$f":"IF('DATA '!$C$103='crop use'!A6,'crop use'!F6,0)","v":0}]
[5,"energie use: biogas, combustion, wood etc","no","yes",1,0,{"$f":"IF('DATA '!$C$103='crop use'!A7,'crop use'!F7,0)","v":0}]
[6,"paper","yes","no",1,0,{"$f":"IF('DATA '!$C$103='crop use'!A8,'crop use'!F8,0)","v":0}]
{"$rows_left_out":15}
{"sheet":"C content soil","index":11,"n_rows":13,"n_cols":8,"rows_kept":13,"cut":false,"hidden":true,"merged":[]}
[]
[1,"Select peat type","BD (g/cm3)","C content (%)","C content (kg C/m2/cm thickness"]
[2,"Sphagnum",7.5999999999999998E-2,46,{"$f":"(C3*(D3/100))*(100*100)/1000","v":0.34959999999999997},null,null,"From: Loisel et al. 2014 - A database and synthesis of northern peatland soil properties and Holocen carbon and nitrogen accumulation. The Holocene 1-15"]
[3,"Herbaceous",0.11799999999999999,50.5,{"$f":"(C4*(D4/100))*(100*100)/1000","v":0.59589999999999999}]
[4,"Woody",0.108,50.9,0.54971999999999999]
[5,"Brown moss",0.17699999999999999,47.9,0.84782999999999997]
[6,"Unknown",0.11799999999999999,46.8,0.55224000000000006]
[7,"Humified",0.192,47.4,0.91007999999999989]
{"$rows_left_out":6}
{"sheet":"CO2-equivalents","index":12,"n_rows":7,"n_cols":11,"rows_kept":7,"cut":false,"hidden":true,"merged":[[1,0,1,13]]}
["Source: Myhre et al. 2013 - Anthropogenic and natural radiative forcing. In: IPCC 2013 0 Climate Change 2013: the natural science basis (Ch. 8)."]
["GWP's are given with and without climate - carbon feedbacks for CH4 and N2O, even though Myhre et al. State that \"it is likely that including the climate–carbon feedback ... provides a better estimate...\" the convention is to use GWP's without climate-carbon feedbacks. "]
["numbers used in SET are for 100 yr (GWP100) and without climate - carbon feedbacks",null,null,null,null,null,null,null,null,null,"Table from Myhre et al."]
[null,"CO2-eq (kg CO2-eq / kg gas)"]
["CO2",1]
["CH4",28]
["N2O",265]

{"sheet":"mol masses","index":13,"n_rows":8,"n_cols":2,"rows_kept":8,"cut":false,"hidden":true,"merged":[]}
["Item","mol mass"]
["C",12.01]
["O",16]
["N",14.01]
["H",1.008]
["CO2",{"$f":"B2+2*B3","v":44.01}]
["CH4",{"$f":"B2+4*B5","v":16.042000000000002}]
["N2O",{"$f":"2*B4+B3","v":44.019999999999996}]
{"$rows_left_out":1}
{"sheet":"Soil Management","index":14,"n_rows":122,"n_cols":23,"rows_kept":122,"cut":false,"hidden":true,"merged":[[28,18,28,19],[29,14,29,16],[43,2,43,3],[48,2,48,3],[85,1,85,5]]}
["Energie"]
[]
["Management"]
[]
["Bodembewerking"]
["Brandstofverbruik verschil per 5 cm werkdiepte",0.1]
["Brandstof verschil tussen 4 en 7 schaar",0.73333333333333295]
["Brandstof verbruik zonder ondergronders min",0.1]
{"$rows_left_out":115}
{"sheet":"grondbew techniek (1)","index":15,"n_rows":33,"n_cols":23,"rows_kept":33,"cut":false,"hidden":true,"merged":[]}
[null,"Nieuwe techniek 1","bron kwin 2012",null,null,null,"bron: Countus",null,null,null,"bron kwin 2012",null,null,null,"bron kwin 2012","bron kwin 2012","bron Agentschap NL 2013"]
[null,null,"prijs aanschaf","prijs aanschaf min","prijs aanschaf max","gem prijs aanschaf","vermogen","vermogen min","vermogen max","gem vermogen","taaktijden","taaktijd min","taaktijd max","gem taaktijd","gem. afschrijving","gem. onderhoud","MIA","Vamil",null,"brandstofverbruik","belasting van de motor"]
[null,null,"euro","euro","euro","euro","kW","kW","kW","kW","uur/ha","uur/ha","uur/ha","uur/ha","%","%",null,null,null,"l/ kW","%","gewicht (kg)","countus waarden"]
[1,"Cultivator schijf","2500-10000",2500,10000,6250,"70-150",70,150,110,"0,75-1",0.75,1,0.875,6,2.5,0,0,null,0.30499999999999999,70,1750,"1000 - 2500"]
[2,"Cultivator vaste tand","3750-20000",3750,20000,11875,"70-150",70,150,110,"0,75-1",0.75,1,0.875,6,3.5,0,0,null,0.30499999999999999,70,1125,"750 - 1500"]
[3,"Cultivator veertand","5130-35000",5130,35000,20065,"70-150",70,150,110,"0,75-1",0.75,1,0.875,6,2.5,0,0,null,0.30499999999999999,70,1125,"750 - 1500"]
[4,"Stoppelcultivator","4000-6000",4000,6000,5000,"70-125",70,125,97.5,"0,75-1",0.75,1,0.875,6,3,0,0,null,0.30499999999999999,70,1125,"750 - 1500"]
[5,"Frontpakker","3500-6000",3500,6000,4750,50,50,50,50,"0,75-1",0.75,1,0.875,7.5,2.5,0,0,null,0.30499999999999999,70,1125,"750 - 1500"]
{"$rows_left_out":26}
{"sheet":"Watermanagement","index":16,"n_rows":0,"n_cols":0,"rows_kept":0,"cut":false,"hidden":true,"merged":[]}

{"sheet":"crop residue paludi","index":17,"n_rows":45,"n_cols":17,"rows_kept":45,"cut":false,"hidden":true,"merged":[[0,0,1,0],[0,2,1,2],[0,3,1,3],[0,4,1,4],[0,5,1,5],[0,16,7,20],[2,1,17,1],[2,2,7,2],[2,3,7,3],[8,2,9,2],[8,3,9,3],[10,2,11,2],[10,3,11,3],[10,5,11,5],[10,14,11,14],[0,6,1,6],[12,2,13,2],[12,3,13,3],[12,5,13,5],[12,14,13,14],[14,2,15,2],[14,3,15,3],[16,2,17,2],[16,3,17,3],[16,5,17,5],[18,0,33,0],[18,1,33,1],[18,2,26,2],[18,3,26,3],[29,14,30,14],[31,2,33,2],[31,3,33,3],[34,0,38,0],[34,1,38,1],[34,2,38,2],[34,3,38,3],[34,6,38,6],[18,6,33,6],[27,2,28,2],[27,3,28,3],[27,5,28,5],[29,2,30,2],[29,3,30,3],[29,5,30,5],[39,1,42,1],[39,2,40,2],[39,3,40,3],[39,14,40,14],[41,2,42,2],[41,3,42,3],[41,5,42,5],[41,14,42,14],[43,0,44,0],[43,1,44,1],[43,2,44,2],[43,3,44,3],[43,6,44,6]]}
["Crop","Water level","Product","Potential for carbon credits","Potential for blue credits","Existing production areas including pilots (in ha) and potential areas (in italics)","References",null,null,null,null,null,null,null,null,null,"Table 1. Overview of important paludiculture crops and applications, range in water levels, existing production areas including pilots and potential areas, potential for carbon credits based on estimates of GHG emission reduction (including biomass use for replacing fossil resources), and potential for blue credits based on suitability for water purification (P) and water storage (S): ++ very high potential, + high potential, 0 little potential, - negative effect."]
[null,"(cm +/- soil surface)",null,null,null,null,null,"Oogstijd","Lengte stoppel (m)","Totale lengte spruit (m)",null,"Oogst ton DS/ha min/max","Oogstrest (ton ds/ha)","bron","Opmerking"]
["Cattail","0 to +20","insulation and building material","+","P +","Kamp (D) 30","Pijlman et al., 2019"]
["(Typha sp.)",null,null,null,"S +","Zuiderveen (NL) 4","Rejmankova 2011"]
[null,null,null,null,null,"Peel (NL) 1","Vroom et al., 2018","nov - feb",0.25,1.8,{"$f":"I5/((1.8+2.5)/2)","v":0.11627906976744186},5,{"$f":"(L5/(J5-I5))*I5","v":0.80645161290322576},"Paetzel 2018"]
[null,null,null,null,null,"Bûtefjild (NL) 0.1","Yavitt and Knapp, 1995","nov - feb",0.25,2.5,null,15,{"$f":"(L6/(J6-I6))*I6","v":1.6666666666666667},"Wichtmann et al. 2016"]
[null,null,null,null,null,"Danube delta (RO)","Wild et al., 2001"]
[null,null,null,null,null,null,"Heinz, 2012"]
{"$rows_left_out":37}