{"text_format":"1","workbook":"xlsx","n_sheets":18,"sheets":["Home","Input","Output","Timeline","DATA ","Outcome","soil moisture classes ","GEST 2.0","N2O Fertilizer cattle cropresid","fossil energy","crop use","C content soil","CO2-equivalents","mol masses","Soil Management","grondbew techniek (1)","Watermanagement","crop residue paludi"],"not_rendered":{"charts":4,"images":9,"macros":0,"external_links":0,"defined_names":1,"comments":5,"pivot_tables":0},"unopened":[],"bounds":{"document_bytes":16777216,"sheet_cells":100000,"rows_first":2000,"rows_last":500,"rows_between":2000,"halvings":0,"cell_chars":16384,"cell_head_chars":4096},"cells_cut":0,"cells_raw":0,"read":"whole","date_system":"1900"}

{"sheet":"Home","index":0,"n_rows":64,"n_cols":5,"rows_kept":64,"cut":false,"hidden":false,"merged":[[1,4,1,5],[33,2,37,7],[27,2,30,7],[48,2,49,7]]}
[]
[null,null,"Carbon Connects",null,"Site Emissions Tool (SET)"]
[]
[]
[]
[]
[]
[]
[]
[]
[]
[]
[]
[]
[]
[]
[]
[]
[]
[]
[]
[null,"Introduction"]
[]
[null,null,"Welcome"]
[null,null,"Welcome to the Carbon Connect Site Emission Tool (SET)! Here you can calculate your greenhouse gas emission of managed wetland areas . "]
[]
[null,null,"Description"]
[null,null,"SET  is a tool created for supporting decision making in the context of land management and environmentally sustainable business development in peatlands. Based on existing information on groundwater level, vegetation, fertilizing practices and feedstock intensity, it estimates CO2 and N2O emission and sequestration after a (hypothetical) rewetting plan."]
[]
[]
[]
[]
[null,null,"Background"]
[null,null,"Agriculture is mostly ignored when countering climate change, even though it causes one third of global C02 emissions. 3% of the world’s land surface is covered by peatlands, which are large concentrations of organic matter having accumulated over centuries. Carbon Connects wants to promote an alternative practice for wet land management that reduces carbon emission by rising water level and planting new crops. Carbon Connects will also develop financially viable business models by developing value chains and use blue and C-credit schemes to enable widespread implementation and scaling-up without public subsidies."]
[]
[]
[]
[]
[]
[null,null,"For whom"]
[null,null,"SET is meant for farmers, public authorities and other stakeholders interested in calculating the greenhouse gas mission of managed wetland areas. "]
[]
[]
[]
[]
[null,"Use of the tool"]
[]
[null,null,"Content"]
[null,null,"The tool has two sections, Input and Output. Input is for entering data on the current circumstance (Baseline) and for the new rewetted  circumstances (Rewetting). Output shows the results. "]
[]
[]
[null,null,"Legenda"]
[null,null,null,"","Bring your mouse cursor to this symbol to read addiitonal information on the data requested"]
[]
[null,null,null,null," Here you can enter the requested data"]
[]
[null,null,null,null,"Use the dropdown to select the appropiate option"]
[]
[]
[]
[]
[null,"Credits"]
[]
[null,null,"The tool is developed by drs. Jasper van Belle and prof. dr. Emiel Elferink. Tool development was made financially possible by Interreg NWE."]

{"sheet":"Input","index":1,"n_rows":118,"n_cols":10,"rows_kept":118,"cut":false,"hidden":false,"merged":[[25,6,25,10],[1,6,1,8]]}
[]
[null,null,"Carbon Connects",null,null,null,"Site Emissions Tool (SET)"]
[]
[]
[]
[]
[]
[]
[]
[]
[]
[]
[]
[]
[]
[]
[]
[]
[]
[]
[]
[null,null,null,"Input data"]
[]
[null,null,null,"General site data"]
[]
[null,null,null,"Site name",""]
[]
[null,null,null,"Total area (ha)","",null,null,"ha"]
[]
[null,null,null,"Coordinates","",null,null,"N",null,"E"]
[]
[null,null,null,"Elevation","",null,null,"m Above Sea Level"]
[]
[null,null,null,"Peat type",""]
[]
[null,null,null,"Peat thickness","",null,null,"cm"]
[]
[null,null,null,"Year rewetting started",""]
[]
[]
[null,null,null,"Baseline: groundwater and vegetation"]
[]
[null,null,null,"Median groundwater level in summer","",null,null,"cm"]
[]
[null,null,null,"Vegetation class",""]
[]
[]
[null,null,null,"Rewetting: groundwater and vegetation"]
[]
[null,null,null,"Median groundwater level in summer","",null,null,"cm"]
[]
[null,null,null,"Vegetation class",""]
[]
[]
[null,null,null,"Baseline: fertilizer use"]
[]
[null,null,null,"Animal manure applied","",null,null,"kg N/ha"]
[]
[null,null,null,"Organic fertilizer applied","",null,null,"kg N/ha"]
[]
[null,null,null,"Synthetic  fertilizer",""]
[]
[null,null,null,"Amount applied","",null,null,"kg N/ha"]
[]
[null,null,null,"Grazing animals",""]
[]
[null,null,null,"Average number of grazing animals","",null,null,"n"]
[]
[null,null,null,"Average number of grazing days ","",null,null,"days/year"]
[]
[null,null,null,"Crop yield","",null,null,"ton dm/ha"]
[]
[null,null,null,"Crop residues",""]
[]
[null,null,null,"Crop","",null,null,"name"]
[]
[]
[null,null,null,"Rewetting: fertilizer use"]
[]
[null,null,null,"Animal manure applied","",null,null,"kg N/ha"]
[]
[null,null,null,"Organic fertilizer applied","",null,null,"kg N/ha"]
[]
[null,null,null,"Synthetic  fertilizer",""]
[]
[null,null,null,"Amount applied","",null,null,"kg N/ha"]
[]
[]
[null,null,null,"Grazing animals",""]
[]
[null,null,null,"Average number of grazing animals","",null,null,"n"]
[]
[null,null,null,"Average number of grazing days ","",null,null,"days/year"]
[]
[null,null,null,"Crop yield","",null,null,"ton dm/ha"]
[]
[null,null,null,"Crop residues",""]
[]
[null,null,null,"Crop","",null,null,"name"]
[]
[]
[null,null,null,"Baseline: activity data"]
[]
[null,null,null,"Land management ","",null,null,"l diesel / site"]
[]
[null,null,null,null,"",null,null,"kWh electricity / site"]
[]
[]
[null,null,null,"Rewetting: activity data"]
[]
[null,null,null,"Land management ","",null,null,"l diesel / site"]
[]
[null,null,null,null,"",null,null,"kWh electricity / site"]
[]
[]
[null,null,null,"Rewetting: crop use "]
[]
[null,null,null,"crop use",""]

{"sheet":"Output","index":2,"n_rows":134,"n_cols":14,"rows_kept":134,"cut":false,"hidden":false,"merged":[[129,10,133,15],[121,10,123,15],[125,10,127,15],[1,6,1,9],[34,8,34,9],[36,8,36,10],[36,5,36,6]]}
[]
[null,null,"Carbon Connects",null,null,null,"Site Emissions Tool (SET)"]
[]
[]
[]
[]
[]
[]
[]
[]
[]
[]
[]
[]
[]
[]
[]
[]
[]
[]
[]
[null,null,null,"Site characteristics"]
[]
[null,null,null,null,"Site name",{"$f":"Input!G26","v":0},null,null,null,"Coordinates",{"$f":"Input!G30","v":0},"N",{"$f":"Input!I30","v":0},"E"]
[]
[null,null,null,null,"Total area (ha)",{"$f":"Input!G28","v":0},"ha"]
[]
[null,null,null,null,"Peat type",{"$f":"VLOOKUP('C content soil'!B13,'C content soil'!A2:E8,2)","v":"Select peat type"}]
[]
[null,null,null,null,"Peat thickness",{"$f":"Input!G36","v":0},"cm"]
[]
[null,null,null,null,"Rewetting started",{"$f":"Input!G38","v":0}]
[]
[null,null,null,null,null,"Baseline",null,null,"After rewetting"]
[null,null,null,null,"Moisture class",{"$f":"'soil moisture classes '!E15","v":"6+: Flooded (lower eulittoral)"},null,null,{"$f":"'soil moisture classes '!E16","v":"6+: Flooded (lower eulittoral)"}]
[]
[null,null,null,null,"Vegetation class",{"$f":"'DATA '!C44","v":"Choose your vegetation class"},null,null,{"$f":"'DATA '!C72","v":"Choose your vegetation class"}]
[]
[]
[]
[null,null,null,"Baseline outcomes"]
[]
[null,null,null,null,"GEST "]
[]
[null,null,null,null,null,"CH4",{"$f":"'DATA '!K42*Input!G28","v":0},null,"tCO2-eq"]
[]
[null,null,null,null,null,"CO2",{"$f":"'DATA '!L42*Input!G28","v":0},null,"tCO2-eq"]
[]
[null,null,null,null,null,"GWP subtotal ",{"$f":"G47+G45","v":0},null,"tCO2-eq"]
[]
[null,null,null,null,"N2O"]
[]
[null,null,null,null,null,"N20 direct",{"$f":"Outcome!D6","v":{"$error":"#DIV/0!"}},null,"tCO2-eq"]
[]
[null,null,null,null,null,"N20 indirect",{"$f":"Outcome!D7","v":{"$error":"#DIV/0!"}},null,"tCO2-eq"]
[]
[null,null,null,null,null,"GWP subtotal ",{"$f":"G53+G55","v":{"$error":"#DIV/0!"}},null,"tCO2-eq"]
[]
[null,null,null,null,"Activity "]
[]
[null,null,null,null,null,"GWP subtotal ",{"$f":"'fossil energy'!D20","v":0},null,"tCO2-eq"]
[]
[null,null,null,null,"TOTAL"]
[]
[null,null,null,null,null,"GWP total ",{"$f":"Outcome!D10","v":{"$error":"#DIV/0!"}},null,"tCO2-eq"]
[]
[]
[null,null,null,"Rewetting outcomes"]
[]
[null,null,null,null,"GEST "]
[]
[null,null,null,null,null,"CH4",{"$f":"Outcome!F4","v":0},null,"tCO2-eq"]
[]
[null,null,null,null,null,"CO2",{"$f":"Outcome!F5","v":0},null,"tCO2-eq"]
[]
[null,null,null,null,null,"GWP subtotal ",{"$f":"G74+G72","v":0},null,"tCO2-eq"]
[]
[null,null,null,null,"N2O"]
[]
[null,null,null,null,null,"N20 direct",{"$f":"Outcome!F6","v":{"$error":"#DIV/0!"}},null,"tCO2-eq"]
[]
[null,null,null,null,null,"N20 indirect",{"$f":"Outcome!F7","v":{"$error":"#DIV/0!"}},null,"tCO2-eq"]
[]
[null,null,null,null,null,"GWP subtotal ",{"$f":"G80+G82","v":{"$error":"#DIV/0!"}},null,"tCO2-eq"]
[]
[null,null,null,null,"Activity "]
[]
[null,null,null,null,null,"GWP subtotal ",{"$f":"Outcome!F9","v":0},null,"tCO2-eq"]
[]
[null,null,null,null,"Product "]
[]
[null,null,null,null,null,"GWP subtotal ",{"$f":"'crop use'!F21","v":0},null,"tCO2-eq"]
[]
[null,null,null,null,"TOTAL"]
[]
[null,null,null,null,null,"GWP total ",{"$f":"Outcome!F10","v":{"$error":"#DIV/0!"}},null,"tCO2-eq"]
[]
[]
[null,null,null,"Carbon savings"]
[]
[null,null,null,"","Net GHG savings"]
[]
[null,null,null,null,null,"Savings total",{"$f":"Outcome!D10-Outcome!F10","v":{"$error":"#DIV/0!"}},null,"tCO2-eq/ year/ site "]
[]
[null,null,null,null,null,null,{"$f":"G103/Input!G28","v":{"$error":"#DIV/0!"}},null,"tCO2-eq/ year/ ha"]
[]
[null,null,null,null,null,"Savings stock",{"$f":"Outcome!D4+Outcome!D5-(Outcome!F4+Outcome!F5)","v":0},null,"tCO2-eq/ year/ site "]
[]
[null,null,null,null,null,null,{"$f":"G107/Input!$G$28","v":{"$error":"#DIV/0!"}},null,"tCO2-eq/ year/ ha"]
[]
[null,null,null,null,null,"Savings flow",{"$f":"Outcome!D6+Outcome!D7+Outcome!D9-(Outcome!F6+Outcome!F7+Outcome!F9)","v":{"$error":"#DIV/0!"}},null,"tCO2-eq/ year/ site "]
[]
[null,null,null,null,null,null,{"$f":"G111/Input!$G$28","v":{"$error":"#DIV/0!"}},null,"tCO2-eq/ year/ ha"]
[]
[null,null,null,null,null,"Savings product use",{"$f":"'crop use'!F21*-1","v":0},null,"tCO2-eq/ year/ site "]
[]
[null,null,null,null,null,null,{"$f":"'crop use'!F20*-1","v":0},null,"tCO2-eq/ year/ ha"]
[]
[]
[null,null,null,null,"Carbon stock peat soil "]
[]
[null,null,null,null,null,"Stock at start year",{"$f":"'C content soil'!F13*Input!G28","v":{"$error":"#VALUE!"}},null,"tCO2-eq/ site",null,"After peat is lost the actual emission from soil is uncertain because without peat soil GEST is no longer applicable."]
[]
[null,null,null,null,null,null,{"$f":"'C content soil'!E13*Input!G28","v":{"$error":"#VALUE!"}},null,"ton C/ site"]
[]
[null,null,null,null,null,null,{"$f":"'C content soil'!F13","v":{"$error":"#VALUE!"}},null,"tCO2-eq/ ha",null,"The visualisation of C-credits shows how much emission reduction or C-sequestration can be claimed for crediting or subsidies."]
[]
[null,null,null,null,null,null,{"$f":"'C content soil'!E13","v":{"$error":"#VALUE!"}},null,"ton C/ ha"]
[]
[null,null,null,null,null,"Time until peat is lost ",null,null,null,null," After peat is lost in the baseline scenario no emission reduction from soil can be claimed, but C-sequestration and emission reduction due to changes in management and replacement of fossil products still apply."]
[]
[null,null,null,null,null,"Baseline",{"$f":"Outcome!D16","v":{"$error":"#VALUE!"}},null,"years"]
[]
[null,null,null,null,null,"Rewetting scenario",{"$f":"Outcome!D17","v":{"$error":"#VALUE!"}},null,"years"]

{"sheet":"Timeline","index":3,"n_rows":52,"n_cols":25,"rows_kept":52,"cut":false,"hidden":true,"merged":[]}
["_",null,"Baseline","Rewetting",null,null,null,null,null,null,null,null,null,null,null,"C-credits"]
["Year","baseline emission","Baseline_GESTv2","rewetting emission","Rewetting_GESTv2","Carbon savings flow","Carbon savings stock","Carbon savings product","Carbon savings_tot","baseline GESTnr","C-sequestration baseline","C-stock soil (baseline)","Stock savings creditable?","Rewet GESTnr","C-sequestration rewet",{"$f":"CONCATENATE(P1,A1,Input!$G$26)","v":"C-credits_"}]
[{"$f":"Input!G38","v":0},{"$f":"Outcome!$D$10","v":{"$error":"#DIV/0!"}},{"$f":"VLOOKUP('DATA '!$C$43,'DATA '!$B$19:$C$40,2,FALSE)","v":"Choose your vegetation class"},{"$f":"Outcome!$F$10","v":{"$error":"#DIV/0!"}},{"$f":"VLOOKUP('DATA '!$C$71,'DATA '!$B$47:$C$69,2,FALSE)","v":"Choose your vegetation class"},{"$f":"(Outcome!$D$6-Outcome!$F$6)+(Outcome!$D$7-Outcome!$F$7)+(Outcome!$D$9-Outcome!$F$9)","v":{"$error":"#DIV/0!"}},{"$f":"(Outcome!$D$5-Outcome!$F$5)+(Outcome!$D$4-Outcome!$F$4)","v":0},{"$f":"Outcome!$D$8 - Outcome!$F$8","v":0},{"$f":"SUM(F3:H3)","v":{"$error":"#DIV/0!"}},{"$f":"LEFT(C3, FIND(\":\",C3)-1)","v":{"$error":"#VALUE!"}},{"$f":"VLOOKUP(J3,'GEST 2.0'!$A$1:$O$45,15,FALSE)*Input!$G$28*-1","v":{"$error":"#VALUE!"}},{"$f":"'C content soil'!E13*Input!G28+K3","v":{"$error":"#VALUE!"}},{"$f":"IF(L3>0,1,0)","v":{"$error":"#VALUE!"}},{"$f":"LEFT(E3, FIND(\":\",E3)-1)","v":{"$error":"#VALUE!"}},{"$f":"VLOOKUP(N3,'GEST 2.0'!$A$1:$O$45,15,FALSE)*Input!$G$28*-1","v":{"$error":"#VALUE!"}},{"$f":"IF(M3=1,I3,F3+H3+IF(O3>0,O3*44/12,0))","v":{"$error":"#VALUE!"}},null,null,null,null,null,null,null,"ppe","Prijs"]
[{"$f":"A3+1","v":1},{"$f":"Outcome!$D$10","v":{"$error":"#DIV/0!"}},{"$f":"VLOOKUP('DATA '!$C$43,'DATA '!$B$19:$C$40,2,FALSE)","v":"Choose your vegetation class"},{"$f":"Outcome!$F$10","v":{"$error":"#DIV/0!"}},{"$f":"VLOOKUP('DATA '!$C$71,'DATA '!$B$47:$C$69,2,FALSE)","v":"Choose your vegetation class"},{"$f":"(Outcome!$D$6-Outcome!$F$6)+(Outcome!$D$7-Outcome!$F$7)+(Outcome!$D$9-Outcome!$F$9)","v":{"$error":"#DIV/0!"}},{"$f":"(Outcome!$D$5-Outcome!$F$5)+(Outcome!$D$4-Outcome!$F$4)","v":0},{"$f":"Outcome!$D$8 - Outcome!$F$8","v":0},{"$f":"SUM(F4:H4)","v":{"$error":"#DIV/0!"}},{"$error":"#VALUE!"},{"$f":"VLOOKUP(J4,'GEST 2.0'!$A$1:$O$45,15,FALSE)*Input!$G$28*-1","v":{"$error":"#VALUE!"}},{"$f":"L3+K4","v":{"$error":"#VALUE!"}},{"$f":"IF(L4>0,1,0)","v":{"$error":"#VALUE!"}},{"$f":"LEFT(E4, FIND(\":\",E4)-1)","v":{"$error":"#VALUE!"}},{"$f":"VLOOKUP(N4,'GEST 2.0'!$A$1:$O$45,15,FALSE)*Input!$G$28*-1","v":{"$error":"#VALUE!"}},{"$f":"IF(M4=1,I4,F4+H4+IF(O4>0,O4*44/12,0))","v":{"$error":"#VALUE!"}},null,null,null,null,"Total C-credits GEST2",null,{"$f":"SUM(P3:P52)","v":{"$error":"#VALUE!"}},70,{"$f":"X4*W4","v":{"$error":"#VALUE!"}}]
[{"$f":"A4+1","v":2},{"$f":"Outcome!$D$10","v":{"$error":"#DIV/0!"}},{"$f":"VLOOKUP('DATA '!$C$43,'DATA '!$B$19:$C$40,2,FALSE)","v":"Choose your vegetation class"},{"$f":"Outcome!$F$10","v":{"$error":"#DIV/0!"}},{"$f":"VLOOKUP('DATA '!$C$71,'DATA '!$B$47:$C$69,2,FALSE)","v":"Choose your vegetation class"},{"$f":"(Outcome!$D$6-Outcome!$F$6)+(Outcome!$D$7-Outcome!$F$7)+(Outcome!$D$9-Outcome!$F$9)","v":{"$error":"#DIV/0!"}},{"$f":"(Outcome!$D$5-Outcome!$F$5)+(Outcome!$D$4-Outcome!$F$4)","v":0},{"$f":"Outcome!$D$8 - Outcome!$F$8","v":0},{"$error":"#DIV/0!"},{"$error":"#VALUE!"},{"$f":"VLOOKUP(J5,'GEST 2.0'!$A$1:$O$45,15,FALSE)*Input!$G$28*-1","v":{"$error":"#VALUE!"}},{"$f":"L4+K5","v":{"$error":"#VALUE!"}},{"$error":"#VALUE!"},{"$error":"#VALUE!"},{"$f":"VLOOKUP(N5,'GEST 2.0'!$A$1:$O$45,15,FALSE)*Input!$G$28*-1","v":{"$error":"#VALUE!"}},{"$error":"#VALUE!"}]
[3,{"$f":"Outcome!$D$10","v":{"$error":"#DIV/0!"}},{"$f":"VLOOKUP('DATA '!$C$43,'DATA '!$B$19:$C$40,2,FALSE)","v":"Choose your vegetation class"},{"$f":"Outcome!$F$10","v":{"$error":"#DIV/0!"}},{"$f":"VLOOKUP('DATA '!$C$71,'DATA '!$B$47:$C$69,2,FALSE)","v":"Choose your vegetation class"},{"$f":"(Outcome!$D$6-Outcome!$F$6)+(Outcome!$D$7-Outcome!$F$7)+(Outcome!$D$9-Outcome!$F$9)","v":{"$error":"#DIV/0!"}},{"$f":"(Outcome!$D$5-Outcome!$F$5)+(Outcome!$D$4-Outcome!$F$4)","v":0},{"$f":"Outcome!$D$8 - Outcome!$F$8","v":0},{"$error":"#DIV/0!"},{"$error":"#VALUE!"},{"$f":"VLOOKUP(J6,'GEST 2.0'!$A$1:$O$45,15,FALSE)*Input!$G$28*-1","v":{"$error":"#VALUE!"}},{"$error":"#VALUE!"},{"$error":"#VALUE!"},{"$error":"#VALUE!"},{"$f":"VLOOKUP(N6,'GEST 2.0'!$A$1:$O$45,15,FALSE)*Input!$G$28*-1","v":{"$error":"#VALUE!"}},{"$error":"#VALUE!"}]
[4,{"$f":"Outcome!$D$10","v":{"$error":"#DIV/0!"}},{"$f":"VLOOKUP('DATA '!$C$43,'DATA '!$B$19:$C$40,2,FALSE)","v":"Choose your vegetation class"},{"$f":"Outcome!$F$10","v":{"$error":"#DIV/0!"}},{"$f":"VLOOKUP('DATA '!$C$71,'DATA '!$B$47:$C$69,2,FALSE)","v":"Choose your vegetation class"},{"$f":"(Outcome!$D$6-Outcome!$F$6)+(Outcome!$D$7-Outcome!$F$7)+(Outcome!$D$9-Outcome!$F$9)","v":{"$error":"#DIV/0!"}},{"$f":"(Outcome!$D$5-Outcome!$F$5)+(Outcome!$D$4-Outcome!$F$4)","v":0},{"$f":"Outcome!$D$8 - Outcome!$F$8","v":0},{"$error":"#DIV/0!"},{"$error":"#VALUE!"},{"$f":"VLOOKUP(J7,'GEST 2.0'!$A$1:$O$45,15,FALSE)*Input!$G$28*-1","v":{"$error":"#VALUE!"}},{"$error":"#VALUE!"},{"$error":"#VALUE!"},{"$error":"#VALUE!"},{"$f":"VLOOKUP(N7,'GEST 2.0'!$A$1:$O$45,15,FALSE)*Input!$G$28*-1","v":{"$error":"#VALUE!"}},{"$error":"#VALUE!"}]
[5,{"$f":"Outcome!$D$10","v":{"$error":"#DIV/0!"}},{"$f":"VLOOKUP('DATA '!$C$43,'DATA '!$B$19:$C$40,2,FALSE)","v":"Choose your vegetation class"},{"$f":"Outcome!$F$10","v":{"$error":"#DIV/0!"}},{"$f":"VLOOKUP('DATA '!$C$71,'DATA '!$B$47:$C$69,2,FALSE)","v":"Choose your vegetation class"},{"$f":"(Outcome!$D$6-Outcome!$F$6)+(Outcome!$D$7-Outcome!$F$7)+(Outcome!$D$9-Outcome!$F$9)","v":{"$error":"#DIV/0!"}},{"$f":"(Outcome!$D$5-Outcome!$F$5)+(Outcome!$D$4-Outcome!$F$4)","v":0},{"$f":"Outcome!$D$8 - Outcome!$F$8","v":0},{"$error":"#DIV/0!"},{"$error":"#VALUE!"},{"$f":"VLOOKUP(J8,'GEST 2.0'!$A$1:$O$45,15,FALSE)*Input!$G$28*-1","v":{"$error":"#VALUE!"}},{"$error":"#VALUE!"},{"$error":"#VALUE!"},{"$error":"#VALUE!"},{"$f":"VLOOKUP(N8,'GEST 2.0'!$A$1:$O$45,15,FALSE)*Input!$G$28*-1","v":{"$error":"#VALUE!"}},{"$error":"#VALUE!"}]
[6,{"$f":"Outcome!$D$10","v":{"$error":"#DIV/0!"}},{"$f":"VLOOKUP('DATA '!$C$43,'DATA '!$B$19:$C$40,2,FALSE)","v":"Choose your vegetation class"},{"$f":"Outcome!$F$10","v":{"$error":"#DIV/0!"}},{"$f":"VLOOKUP('DATA '!$C$71,'DATA '!$B$47:$C$69,2,FALSE)","v":"Choose your vegetation class"},{"$f":"(Outcome!$D$6-Outcome!$F$6)+(Outcome!$D$7-Outcome!$F$7)+(Outcome!$D$9-Outcome!$F$9)","v":{"$error":"#DIV/0!"}},{"$f":"(Outcome!$D$5-Outcome!$F$5)+(Outcome!$D$4-Outcome!$F$4)","v":0},{"$f":"Outcome!$D$8 - Outcome!$F$8","v":0},{"$error":"#DIV/0!"},{"$error":"#VALUE!"},{"$f":"VLOOKUP(J9,'GEST 2.0'!$A$1:$O$45,15,FALSE)*Input!$G$28*-1","v":{"$error":"#VALUE!"}},{"$error":"#VALUE!"},{"$error":"#VALUE!"},{"$error":"#VALUE!"},{"$f":"VLOOKUP(N9,'GEST 2.0'!$A$1:$O$45,15,FALSE)*Input!$G$28*-1","v":{"$error":"#VALUE!"}},{"$error":"#VALUE!"}]
[7,{"$f":"Outcome!$D$10","v":{"$error":"#DIV/0!"}},{"$f":"VLOOKUP('DATA '!$C$43,'DATA '!$B$19:$C$40,2,FALSE)","v":"Choose your vegetation class"},{"$f":"Outcome!$F$10","v":{"$error":"#DIV/0!"}},{"$f":"VLOOKUP('DATA '!$C$71,'DATA '!$B$47:$C$69,2,FALSE)","v":"Choose your vegetation class"},{"$f":"(Outcome!$D$6-Outcome!$F$6)+(Outcome!$D$7-Outcome!$F$7)+(Outcome!$D$9-Outcome!$F$9)","v":{"$error":"#DIV/0!"}},{"$f":"(Outcome!$D$5-Outcome!$F$5)+(Outcome!$D$4-Outcome!$F$4)","v":0},{"$f":"Outcome!$D$8 - Outcome!$F$8","v":0},{"$error":"#DIV/0!"},{"$error":"#VALUE!"},{"$f":"VLOOKUP(J10,'GEST 2.0'!$A$1:$O$45,15,FALSE)*Input!$G$28*-1","v":{"$error":"#VALUE!"}},{"$error":"#VALUE!"},{"$error":"#VALUE!"},{"$error":"#VALUE!"},{"$f":"VLOOKUP(N10,'GEST 2.0'!$A$1:$O$45,15,FALSE)*Input!$G$28*-1","v":{"$error":"#VALUE!"}},{"$error":"#VALUE!"}]
[8,{"$f":"Outcome!$D$10","v":{"$error":"#DIV/0!"}},{"$f":"VLOOKUP('DATA '!$C$43,'DATA '!$B$19:$C$40,2,FALSE)","v":"Choose your vegetation class"},{"$f":"Outcome!$F$10","v":{"$error":"#DIV/0!"}},{"$f":"VLOOKUP('DATA '!$C$71,'DATA '!$B$47:$C$69,2,FALSE)","v":"Choose your vegetation class"},{"$f":"(Outcome!$D$6-Outcome!$F$6)+(Outcome!$D$7-Outcome!$F$7)+(Outcome!$D$9-Outcome!$F$9)","v":{"$error":"#DIV/0!"}},{"$f":"(Outcome!$D$5-Outcome!$F$5)+(Outcome!$D$4-Outcome!$F$4)","v":0},{"$f":"Outcome!$D$8 - Outcome!$F$8","v":0},{"$error":"#DIV/0!"},{"$error":"#VALUE!"},{"$f":"VLOOKUP(J11,'GEST 2.0'!$A$1:$O$45,15,FALSE)*Input!$G$28*-1","v":{"$error":"#VALUE!"}},{"$error":"#VALUE!"},{"$error":"#VALUE!"},{"$error":"#VALUE!"},{"$f":"VLOOKUP(N11,'GEST 2.0'!$A$1:$O$45,15,FALSE)*Input!$G$28*-1","v":{"$error":"#VALUE!"}},{"$error":"#VALUE!"}]
[9,{"$f":"Outcome!$D$10","v":{"$error":"#DIV/0!"}},{"$f":"VLOOKUP('DATA '!$C$43,'DATA '!$B$19:$C$40,2,FALSE)","v":"Choose your vegetation class"},{"$f":"Outcome!$F$10","v":{"$error":"#DIV/0!"}},{"$f":"VLOOKUP('DATA '!$C$71,'DATA '!$B$47:$C$69,2,FALSE)","v":"Choose your vegetation class"},{"$f":"(Outcome!$D$6-Outcome!$F$6)+(Outcome!$D$7-Outcome!$F$7)+(Outcome!$D$9-Outcome!$F$9)","v":{"$error":"#DIV/0!"}},{"$f":"(Outcome!$D$5-Outcome!$F$5)+(Outcome!$D$4-Outcome!$F$4)","v":0},{"$f":"Outcome!$D$8 - Outcome!$F$8","v":0},{"$error":"#DIV/0!"},{"$error":"#VALUE!"},{"$f":"VLOOKUP(J12,'GEST 2.0'!$A$1:$O$45,15,FALSE)*Input!$G$28*-1","v":{"$error":"#VALUE!"}},{"$error":"#VALUE!"},{"$error":"#VALUE!"},{"$error":"#VALUE!"},{"$f":"VLOOKUP(N12,'GEST 2.0'!$A$1:$O$45,15,FALSE)*Input!$G$28*-1","v":{"$error":"#VALUE!"}},{"$error":"#VALUE!"}]
[10,{"$f":"Outcome!$D$10","v":{"$error":"#DIV/0!"}},{"$f":"VLOOKUP('DATA '!$C$43,'DATA '!$B$19:$C$40,2,FALSE)","v":"Choose your vegetation class"},{"$f":"Outcome!$F$10","v":{"$error":"#DIV/0!"}},{"$f":"VLOOKUP('DATA '!$C$71,'DATA '!$B$47:$C$69,2,FALSE)","v":"Choose your vegetation class"},{"$f":"(Outcome!$D$6-Outcome!$F$6)+(Outcome!$D$7-Outcome!$F$7)+(Outcome!$D$9-Outcome!$F$9)","v":{"$error":"#DIV/0!"}},{"$f":"(Outcome!$D$5-Outcome!$F$5)+(Outcome!$D$4-Outcome!$F$4)","v":0},{"$f":"Outcome!$D$8 - Outcome!$F$8","v":0},{"$error":"#DIV/0!"},{"$error":"#VALUE!"},{"$f":"VLOOKUP(J13,'GEST 2.0'!$A$1:$O$45,15,FALSE)*Input!$G$28*-1","v":{"$error":"#VALUE!"}},{"$error":"#VALUE!"},{"$error":"#VALUE!"},{"$error":"#VALUE!"},{"$f":"VLOOKUP(N13,'GEST 2.0'!$A$1:$O$45,15,FALSE)*Input!$G$28*-1","v":{"$error":"#VALUE!"}},{"$error":"#VALUE!"}]
[11,{"$f":"Outcome!$D$10","v":{"$error":"#DIV/0!"}},{"$f":"VLOOKUP('DATA '!$C$43,'DATA '!$B$19:$C$40,2,FALSE)","v":"Choose your vegetation class"},{"$f":"Outcome!$F$10","v":{"$error":"#DIV/0!"}},{"$f":"VLOOKUP('DATA '!$C$71,'DATA '!$B$47:$C$69,2,FALSE)","v":"Choose your vegetation class"},{"$f":"(Outcome!$D$6-Outcome!$F$6)+(Outcome!$D$7-Outcome!$F$7)+(Outcome!$D$9-Outcome!$F$9)","v":{"$error":"#DIV/0!"}},{"$f":"(Outcome!$D$5-Outcome!$F$5)+(Outcome!$D$4-Outcome!$F$4)","v":0},{"$f":"Outcome!$D$8 - Outcome!$F$8","v":0},{"$error":"#DIV/0!"},{"$error":"#VALUE!"},{"$f":"VLOOKUP(J14,'GEST 2.0'!$A$1:$O$45,15,FALSE)*Input!$G$28*-1","v":{"$error":"#VALUE!"}},{"$error":"#VALUE!"},{"$error":"#VALUE!"},{"$error":"#VALUE!"},{"$f":"VLOOKUP(N14,'GEST 2.0'!$A$1:$O$45,15,FALSE)*Input!$G$28*-1","v":{"$error":"#VALUE!"}},{"$error":"#VALUE!"}]
[12,{"$f":"Outcome!$D$10","v":{"$error":"#DIV/0!"}},{"$f":"VLOOKUP('DATA '!$C$43,'DATA '!$B$19:$C$40,2,FALSE)","v":"Choose your vegetation class"},{"$f":"Outcome!$F$10","v":{"$error":"#DIV/0!"}},{"$f":"VLOOKUP('DATA '!$C$71,'DATA '!$B$47:$C$69,2,FALSE)","v":"Choose your vegetation class"},{"$f":"(Outcome!$D$6-Outcome!$F$6)+(Outcome!$D$7-Outcome!$F$7)+(Outcome!$D$9-Outcome!$F$9)","v":{"$error":"#DIV/0!"}},{"$f":"(Outcome!$D$5-Outcome!$F$5)+(Outcome!$D$4-Outcome!$F$4)","v":0},{"$f":"Outcome!$D$8 - Outcome!$F$8","v":0},{"$error":"#DIV/0!"},{"$error":"#VALUE!"},{"$f":"VLOOKUP(J15,'GEST 2.0'!$A$1:$O$45,15,FALSE)*Input!$G$28*-1","v":{"$error":"#VALUE!"}},{"$error":"#VALUE!"},{"$error":"#VALUE!"},{"$error":"#VALUE!"},{"$f":"VLOOKUP(N15,'GEST 2.0'!$A$1:$O$45,15,FALSE)*Input!$G$28*-1","v":{"$error":"#VALUE!"}},{"$error":"#VALUE!"}]
[13,{"$f":"Outcome!$D$10","v":{"$error":"#DIV/0!"}},{"$f":"VLOOKUP('DATA '!$C$43,'DATA '!$B$19:$C$40,2,FALSE)","v":"Choose your vegetation class"},{"$f":"Outcome!$F$10","v":{"$error":"#DIV/0!"}},{"$f":"VLOOKUP('DATA '!$C$71,'DATA '!$B$47:$C$69,2,FALSE)","v":"Choose your vegetation class"},{"$f":"(Outcome!$D$6-Outcome!$F$6)+(Outcome!$D$7-Outcome!$F$7)+(Outcome!$D$9-Outcome!$F$9)","v":{"$error":"#DIV/0!"}},{"$f":"(Outcome!$D$5-Outcome!$F$5)+(Outcome!$D$4-Outcome!$F$4)","v":0},{"$f":"Outcome!$D$8 - Outcome!$F$8","v":0},{"$error":"#DIV/0!"},{"$error":"#VALUE!"},{"$f":"VLOOKUP(J16,'GEST 2.0'!$A$1:$O$45,15,FALSE)*Input!$G$28*-1","v":{"$error":"#VALUE!"}},{"$error":"#VALUE!"},{"$error":"#VALUE!"},{"$error":"#VALUE!"},{"$f":"VLOOKUP(N16,'GEST 2.0'!$A$1:$O$45,15,FALSE)*Input!$G$28*-1","v":{"$error":"#VALUE!"}},{"$error":"#VALUE!"}]
[14,{"$f":"Outcome!$D$10","v":{"$error":"#DIV/0!"}},{"$f":"VLOOKUP('DATA '!$C$43,'DATA '!$B$19:$C$40,2,FALSE)","v":"Choose your vegetation class"},{"$f":"Outcome!$F$10","v":{"$error":"#DIV/0!"}},{"$f":"VLOOKUP('DATA '!$C$71,'DATA '!$B$47:$C$69,2,FALSE)","v":"Choose your vegetation class"},{"$f":"(Outcome!$D$6-Outcome!$F$6)+(Outcome!$D$7-Outcome!$F$7)+(Outcome!$D$9-Outcome!$F$9)","v":{"$error":"#DIV/0!"}},{"$f":"(Outcome!$D$5-Outcome!$F$5)+(Outcome!$D$4-Outcome!$F$4)","v":0},{"$f":"Outcome!$D$8 - Outcome!$F$8","v":0},{"$error":"#DIV/0!"},{"$error":"#VALUE!"},{"$f":"VLOOKUP(J17,'GEST 2.0'!$A$1:$O$45,15,FALSE)*Input!$G$28*-1","v":{"$error":"#VALUE!"}},{"$error":"#VALUE!"},{"$error":"#VALUE!"},{"$error":"#VALUE!"},{"$f":"VLOOKUP(N17,'GEST 2.0'!$A$1:$O$45,15,FALSE)*Input!$G$28*-1","v":{"$error":"#VALUE!"}},{"$error":"#VALUE!"}]
[15,{"$f":"Outcome!$D$10","v":{"$error":"#DIV/0!"}},{"$f":"VLOOKUP('DATA '!$C$43,'DATA '!$B$19:$C$40,2,FALSE)","v":"Choose your vegetation class"},{"$f":"Outcome!$F$10","v":{"$error":"#DIV/0!"}},{"$f":"VLOOKUP('DATA '!$C$71,'DATA '!$B$47:$C$69,2,FALSE)","v":"Choose your vegetation class"},{"$f":"(Outcome!$D$6-Outcome!$F$6)+(Outcome!$D$7-Outcome!$F$7)+(Outcome!$D$9-Outcome!$F$9)","v":{"$error":"#DIV/0!"}},{"$f":"(Outcome!$D$5-Outcome!$F$5)+(Outcome!$D$4-Outcome!$F$4)","v":0},{"$f":"Outcome!$D$8 - Outcome!$F$8","v":0},{"$error":"#DIV/0!"},{"$error":"#VALUE!"},{"$f":"VLOOKUP(J18,'GEST 2.0'!$A$1:$O$45,15,FALSE)*Input!$G$28*-1","v":{"$error":"#VALUE!"}},{"$error":"#VALUE!"},{"$error":"#VALUE!"},{"$error":"#VALUE!"},{"$f":"VLOOKUP(N18,'GEST 2.0'!$A$1:$O$45,15,FALSE)*Input!$G$28*-1","v":{"$error":"#VALUE!"}},{"$error":"#VALUE!"}]
[16,{"$f":"Outcome!$D$10","v":{"$error":"#DIV/0!"}},{"$f":"VLOOKUP('DATA '!$C$43,'DATA '!$B$19:$C$40,2,FALSE)","v":"Choose your vegetation class"},{"$f":"Outcome!$F$10","v":{"$error":"#DIV/0!"}},{"$f":"VLOOKUP('DATA '!$C$71,'DATA '!$B$47:$C$69,2,FALSE)","v":"Choose your vegetation class"},{"$f":"(Outcome!$D$6-Outcome!$F$6)+(Outcome!$D$7-Outcome!$F$7)+(Outcome!$D$9-Outcome!$F$9)","v":{"$error":"#DIV/0!"}},{"$f":"(Outcome!$D$5-Outcome!$F$5)+(Outcome!$D$4-Outcome!$F$4)","v":0},{"$f":"Outcome!$D$8 - Outcome!$F$8","v":0},{"$error":"#DIV/0!"},{"$error":"#VALUE!"},{"$f":"VLOOKUP(J19,'GEST 2.0'!$A$1:$O$45,15,FALSE)*Input!$G$28*-1","v":{"$error":"#VALUE!"}},{"$error":"#VALUE!"},{"$error":"#VALUE!"},{"$error":"#VALUE!"},{"$f":"VLOOKUP(N19,'GEST 2.0'!$A$1:$O$45,15,FALSE)*Input!$G$28*-1","v":{"$error":"#VALUE!"}},{"$error":"#VALUE!"}]
[17,{"$f":"Outcome!$D$10","v":{"$error":"#DIV/0!"}},{"$f":"VLOOKUP('DATA '!$C$43,'DATA '!$B$19:$C$40,2,FALSE)","v":"Choose your vegetation class"},{"$f":"Outcome!$F$10","v":{"$error":"#DIV/0!"}},{"$f":"VLOOKUP('DATA '!$C$71,'DATA '!$B$47:$C$69,2,FALSE)","v":"Choose your vegetation class"},{"$f":"(Outcome!$D$6-Outcome!$F$6)+(Outcome!$D$7-Outcome!$F$7)+(Outcome!$D$9-Outcome!$F$9)","v":{"$error":"#DIV/0!"}},{"$f":"(Outcome!$D$5-Outcome!$F$5)+(Outcome!$D$4-Outcome!$F$4)","v":0},{"$f":"Outcome!$D$8 - Outcome!$F$8","v":0},{"$error":"#DIV/0!"},{"$error":"#VALUE!"},{"$f":"VLOOKUP(J20,'GEST 2.0'!$A$1:$O$45,15,FALSE)*Input!$G$28*-1","v":{"$error":"#VALUE!"}},{"$error":"#VALUE!"},{"$error":"#VALUE!"},{"$error":"#VALUE!"},{"$f":"VLOOKUP(N20,'GEST 2.0'!$A$1:$O$45,15,FALSE)*Input!$G$28*-1","v":{"$error":"#VALUE!"}},{"$error":"#VALUE!"}]
[18,{"$f":"Outcome!$D$10","v":{"$error":"#DIV/0!"}},{"$f":"VLOOKUP('DATA '!$C$43,'DATA '!$B$19:$C$40,2,FALSE)","v":"Choose your vegetation class"},{"$f":"Outcome!$F$10","v":{"$error":"#DIV/0!"}},{"$f":"VLOOKUP('DATA '!$C$71,'DATA '!$B$47:$C$69,2,FALSE)","v":"Choose your vegetation class"},{"$f":"(Outcome!$D$6-Outcome!$F$6)+(Outcome!$D$7-Outcome!$F$7)+(Outcome!$D$9-Outcome!$F$9)","v":{"$error":"#DIV/0!"}},{"$f":"(Outcome!$D$5-Outcome!$F$5)+(Outcome!$D$4-Outcome!$F$4)","v":0},{"$f":"Outcome!$D$8 - Outcome!$F$8","v":0},{"$error":"#DIV/0!"},{"$error":"#VALUE!"},{"$f":"VLOOKUP(J21,'GEST 2.0'!$A$1:$O$45,15,FALSE)*Input!$G$28*-1","v":{"$error":"#VALUE!"}},{"$error":"#VALUE!"},{"$error":"#VALUE!"},{"$error":"#VALUE!"},{"$f":"VLOOKUP(N21,'GEST 2.0'!$A$1:$O$45,15,FALSE)*Input!$G$28*-1","v":{"$error":"#VALUE!"}},{"$error":"#VALUE!"}]
[19,{"$f":"Outcome!$D$10","v":{"$error":"#DIV/0!"}},{"$f":"VLOOKUP('DATA '!$C$43,'DATA '!$B$19:$C$40,2,FALSE)","v":"Choose your vegetation class"},{"$f":"Outcome!$F$10","v":{"$error":"#DIV/0!"}},{"$f":"VLOOKUP('DATA '!$C$71,'DATA '!$B$47:$C$69,2,FALSE)","v":"Choose your vegetation class"},{"$f":"(Outcome!$D$6-Outcome!$F$6)+(Outcome!$D$7-Outcome!$F$7)+(Outcome!$D$9-Outcome!$F$9)","v":{"$error":"#DIV/0!"}},{"$f":"(Outcome!$D$5-Outcome!$F$5)+(Outcome!$D$4-Outcome!$F$4)","v":0},{"$f":"Outcome!$D$8 - Outcome!$F$8","v":0},{"$error":"#DIV/0!"},{"$error":"#VALUE!"},{"$f":"VLOOKUP(J22,'GEST 2.0'!$A$1:$O$45,15,FALSE)*Input!$G$28*-1","v":{"$error":"#VALUE!"}},{"$error":"#VALUE!"},{"$error":"#VALUE!"},{"$error":"#VALUE!"},{"$f":"VLOOKUP(N22,'GEST 2.0'!$A$1:$O$45,15,FALSE)*Input!$G$28*-1","v":{"$error":"#VALUE!"}},{"$error":"#VALUE!"}]
[20,{"$f":"Outcome!$D$10","v":{"$error":"#DIV/0!"}},{"$f":"VLOOKUP('DATA '!$C$43,'DATA '!$B$19:$C$40,2,FALSE)","v":"Choose your vegetation class"},{"$f":"Outcome!$F$10","v":{"$error":"#DIV/0!"}},{"$f":"VLOOKUP('DATA '!$C$71,'DATA '!$B$47:$C$69,2,FALSE)","v":"Choose your vegetation class"},{"$f":"(Outcome!$D$6-Outcome!$F$6)+(Outcome!$D$7-Outcome!$F$7)+(Outcome!$D$9-Outcome!$F$9)","v":{"$error":"#DIV/0!"}},{"$f":"(Outcome!$D$5-Outcome!$F$5)+(Outcome!$D$4-Outcome!$F$4)","v":0},{"$f":"Outcome!$D$8 - Outcome!$F$8","v":0},{"$error":"#DIV/0!"},{"$error":"#VALUE!"},{"$f":"VLOOKUP(J23,'GEST 2.0'!$A$1:$O$45,15,FALSE)*Input!$G$28*-1","v":{"$error":"#VALUE!"}},{"$error":"#VALUE!"},{"$error":"#VALUE!"},{"$error":"#VALUE!"},{"$f":"VLOOKUP(N23,'GEST 2.0'!$A$1:$O$45,15,FALSE)*Input!$G$28*-1","v":{"$error":"#VALUE!"}},{"$error":"#VALUE!"}]
[21,{"$f":"Outcome!$D$10","v":{"$error":"#DIV/0!"}},{"$f":"VLOOKUP('DATA '!$C$43,'DATA '!$B$19:$C$40,2,FALSE)","v":"Choose your vegetation class"},{"$f":"Outcome!$F$10","v":{"$error":"#DIV/0!"}},{"$f":"VLOOKUP('DATA '!$C$71,'DATA '!$B$47:$C$69,2,FALSE)","v":"Choose your vegetation class"},{"$f":"(Outcome!$D$6-Outcome!$F$6)+(Outcome!$D$7-Outcome!$F$7)+(Outcome!$D$9-Outcome!$F$9)","v":{"$error":"#DIV/0!"}},{"$f":"(Outcome!$D$5-Outcome!$F$5)+(Outcome!$D$4-Outcome!$F$4)","v":0},{"$f":"Outcome!$D$8 - Outcome!$F$8","v":0},{"$error":"#DIV/0!"},{"$error":"#VALUE!"},{"$f":"VLOOKUP(J24,'GEST 2.0'!$A$1:$O$45,15,FALSE)*Input!$G$28*-1","v":{"$error":"#VALUE!"}},{"$error":"#VALUE!"},{"$error":"#VALUE!"},{"$error":"#VALUE!"},{"$f":"VLOOKUP(N24,'GEST 2.0'!$A$1:$O$45,15,FALSE)*Input!$G$28*-1","v":{"$error":"#VALUE!"}},{"$error":"#VALUE!"}]
[22,{"$f":"Outcome!$D$10","v":{"$error":"#DIV/0!"}},{"$f":"VLOOKUP('DATA '!$C$43,'DATA '!$B$19:$C$40,2,FALSE)","v":"Choose your vegetation class"},{"$f":"Outcome!$F$10","v":{"$error":"#DIV/0!"}},{"$f":"VLOOKUP('DATA '!$C$71,'DATA '!$B$47:$C$69,2,FALSE)","v":"Choose your vegetation class"},{"$f":"(Outcome!$D$6-Outcome!$F$6)+(Outcome!$D$7-Outcome!$F$7)+(Outcome!$D$9-Outcome!$F$9)","v":{"$error":"#DIV/0!"}},{"$f":"(Outcome!$D$5-Outcome!$F$5)+(Outcome!$D$4-Outcome!$F$4)","v":0},{"$f":"Outcome!$D$8 - Outcome!$F$8","v":0},{"$error":"#DIV/0!"},{"$error":"#VALUE!"},{"$f":"VLOOKUP(J25,'GEST 2.0'!$A$1:$O$45,15,FALSE)*Input!$G$28*-1","v":{"$error":"#VALUE!"}},{"$error":"#VALUE!"},{"$error":"#VALUE!"},{"$error":"#VALUE!"},{"$f":"VLOOKUP(N25,'GEST 2.0'!$A$1:$O$45,15,FALSE)*Input!$G$28*-1","v":{"$error":"#VALUE!"}},{"$error":"#VALUE!"}]
[23,{"$f":"Outcome!$D$10","v":{"$error":"#DIV/0!"}},{"$f":"VLOOKUP('DATA '!$C$43,'DATA '!$B$19:$C$40,2,FALSE)","v":"Choose your vegetation class"},{"$f":"Outcome!$F$10","v":{"$error":"#DIV/0!"}},{"$f":"VLOOKUP('DATA '!$C$71,'DATA '!$B$47:$C$69,2,FALSE)","v":"Choose your vegetation class"},{"$f":"(Outcome!$D$6-Outcome!$F$6)+(Outcome!$D$7-Outcome!$F$7)+(Outcome!$D$9-Outcome!$F$9)","v":{"$error":"#DIV/0!"}},{"$f":"(Outcome!$D$5-Outcome!$F$5)+(Outcome!$D$4-Outcome!$F$4)","v":0},{"$f":"Outcome!$D$8 - Outcome!$F$8","v":0},{"$error":"#DIV/0!"},{"$error":"#VALUE!"},{"$f":"VLOOKUP(J26,'GEST 2.0'!$A$1:$O$45,15,FALSE)*Input!$G$28*-1","v":{"$error":"#VALUE!"}},{"$error":"#VALUE!"},{"$error":"#VALUE!"},{"$error":"#VALUE!"},{"$f":"VLOOKUP(N26,'GEST 2.0'!$A$1:$O$45,15,FALSE)*Input!$G$28*-1","v":{"$error":"#VALUE!"}},{"$error":"#VALUE!"}]
[24,{"$f":"Outcome!$D$10","v":{"$error":"#DIV/0!"}},{"$f":"VLOOKUP('DATA '!$C$43,'DATA '!$B$19:$C$40,2,FALSE)","v":"Choose your vegetation class"},{"$f":"Outcome!$F$10","v":{"$error":"#DIV/0!"}},{"$f":"VLOOKUP('DATA '!$C$71,'DATA '!$B$47:$C$69,2,FALSE)","v":"Choose your vegetation class"},{"$f":"(Outcome!$D$6-Outcome!$F$6)+(Outcome!$D$7-Outcome!$F$7)+(Outcome!$D$9-Outcome!$F$9)","v":{"$error":"#DIV/0!"}},{"$f":"(Outcome!$D$5-Outcome!$F$5)+(Outcome!$D$4-Outcome!$F$4)","v":0},{"$f":"Outcome!$D$8 - Outcome!$F$8","v":0},{"$error":"#DIV/0!"},{"$error":"#VALUE!"},{"$f":"VLOOKUP(J27,'GEST 2.0'!$A$1:$O$45,15,FALSE)*Input!$G$28*-1","v":{"$error":"#VALUE!"}},{"$error":"#VALUE!"},{"$error":"#VALUE!"},{"$error":"#VALUE!"},{"$f":"VLOOKUP(N27,'GEST 2.0'!$A$1:$O$45,15,FALSE)*Input!$G$28*-1","v":{"$error":"#VALUE!"}},{"$error":"#VALUE!"}]
[25,{"$f":"Outcome!$D$10","v":{"$error":"#DIV/0!"}},{"$f":"VLOOKUP('DATA '!$C$43,'DATA '!$B$19:$C$40,2,FALSE)","v":"Choose your vegetation class"},{"$f":"Outcome!$F$10","v":{"$error":"#DIV/0!"}},{"$f":"VLOOKUP('DATA '!$C$71,'DATA '!$B$47:$C$69,2,FALSE)","v":"Choose your vegetation class"},{"$f":"(Outcome!$D$6-Outcome!$F$6)+(Outcome!$D$7-Outcome!$F$7)+(Outcome!$D$9-Outcome!$F$9)","v":{"$error":"#DIV/0!"}},{"$f":"(Outcome!$D$5-Outcome!$F$5)+(Outcome!$D$4-Outcome!$F$4)","v":0},{"$f":"Outcome!$D$8 - Outcome!$F$8","v":0},{"$error":"#DIV/0!"},{"$error":"#VALUE!"},{"$f":"VLOOKUP(J28,'GEST 2.0'!$A$1:$O$45,15,FALSE)*Input!$G$28*-1","v":{"$error":"#VALUE!"}},{"$error":"#VALUE!"},{"$error":"#VALUE!"},{"$error":"#VALUE!"},{"$f":"VLOOKUP(N28,'GEST 2.0'!$A$1:$O$45,15,FALSE)*Input!$G$28*-1","v":{"$error":"#VALUE!"}},{"$error":"#VALUE!"}]
[26,{"$f":"Outcome!$D$10","v":{"$error":"#DIV/0!"}},{"$f":"VLOOKUP('DATA '!$C$43,'DATA '!$B$19:$C$40,2,FALSE)","v":"Choose your vegetation class"},{"$f":"Outcome!$F$10","v":{"$error":"#DIV/0!"}},{"$f":"VLOOKUP('DATA '!$C$71,'DATA '!$B$47:$C$69,2,FALSE)","v":"Choose your vegetation class"},{"$f":"(Outcome!$D$6-Outcome!$F$6)+(Outcome!$D$7-Outcome!$F$7)+(Outcome!$D$9-Outcome!$F$9)","v":{"$error":"#DIV/0!"}},{"$f":"(Outcome!$D$5-Outcome!$F$5)+(Outcome!$D$4-Outcome!$F$4)","v":0},{"$f":"Outcome!$D$8 - Outcome!$F$8","v":0},{"$error":"#DIV/0!"},{"$error":"#VALUE!"},{"$f":"VLOOKUP(J29,'GEST 2.0'!$A$1:$O$45,15,FALSE)*Input!$G$28*-1","v":{"$error":"#VALUE!"}},{"$error":"#VALUE!"},{"$error":"#VALUE!"},{"$error":"#VALUE!"},{"$f":"VLOOKUP(N29,'GEST 2.0'!$A$1:$O$45,15,FALSE)*Input!$G$28*-1","v":{"$error":"#VALUE!"}},{"$error":"#VALUE!"}]
[27,{"$f":"Outcome!$D$10","v":{"$error":"#DIV/0!"}},{"$f":"VLOOKUP('DATA '!$C$43,'DATA '!$B$19:$C$40,2,FALSE)","v":"Choose your vegetation class"},{"$f":"Outcome!$F$10","v":{"$error":"#DIV/0!"}},{"$f":"VLOOKUP('DATA '!$C$71,'DATA '!$B$47:$C$69,2,FALSE)","v":"Choose your vegetation class"},{"$f":"(Outcome!$D$6-Outcome!$F$6)+(Outcome!$D$7-Outcome!$F$7)+(Outcome!$D$9-Outcome!$F$9)","v":{"$error":"#DIV/0!"}},{"$f":"(Outcome!$D$5-Outcome!$F$5)+(Outcome!$D$4-Outcome!$F$4)","v":0},{"$f":"Outcome!$D$8 - Outcome!$F$8","v":0},{"$error":"#DIV/0!"},{"$error":"#VALUE!"},{"$f":"VLOOKUP(J30,'GEST 2.0'!$A$1:$O$45,15,FALSE)*Input!$G$28*-1","v":{"$error":"#VALUE!"}},{"$error":"#VALUE!"},{"$error":"#VALUE!"},{"$error":"#VALUE!"},{"$f":"VLOOKUP(N30,'GEST 2.0'!$A$1:$O$45,15,FALSE)*Input!$G$28*-1","v":{"$error":"#VALUE!"}},{"$error":"#VALUE!"}]
[28,{"$f":"Outcome!$D$10","v":{"$error":"#DIV/0!"}},{"$f":"VLOOKUP('DATA '!$C$43,'DATA '!$B$19:$C$40,2,FALSE)","v":"Choose your vegetation class"},{"$f":"Outcome!$F$10","v":{"$error":"#DIV/0!"}},{"$f":"VLOOKUP('DATA '!$C$71,'DATA '!$B$47:$C$69,2,FALSE)","v":"Choose your vegetation class"},{"$f":"(Outcome!$D$6-Outcome!$F$6)+(Outcome!$D$7-Outcome!$F$7)+(Outcome!$D$9-Outcome!$F$9)","v":{"$error":"#DIV/0!"}},{"$f":"(Outcome!$D$5-Outcome!$F$5)+(Outcome!$D$4-Outcome!$F$4)","v":0},{"$f":"Outcome!$D$8 - Outcome!$F$8","v":0},{"$error":"#DIV/0!"},{"$error":"#VALUE!"},{"$f":"VLOOKUP(J31,'GEST 2.0'!$A$1:$O$45,15,FALSE)*Input!$G$28*-1","v":{"$error":"#VALUE!"}},{"$error":"#VALUE!"},{"$error":"#VALUE!"},{"$error":"#VALUE!"},{"$f":"VLOOKUP(N31,'GEST 2.0'!$A$1:$O$45,15,FALSE)*Input!$G$28*-1","v":{"$error":"#VALUE!"}},{"$error":"#VALUE!"}]
[29,{"$f":"Outcome!$D$10","v":{"$error":"#DIV/0!"}},{"$f":"VLOOKUP('DATA '!$C$43,'DATA '!$B$19:$C$40,2,FALSE)","v":"Choose your vegetation class"},{"$f":"Outcome!$F$10","v":{"$error":"#DIV/0!"}},{"$f":"VLOOKUP('DATA '!$C$71,'DATA '!$B$47:$C$69,2,FALSE)","v":"Choose your vegetation class"},{"$f":"(Outcome!$D$6-Outcome!$F$6)+(Outcome!$D$7-Outcome!$F$7)+(Outcome!$D$9-Outcome!$F$9)","v":{"$error":"#DIV/0!"}},{"$f":"(Outcome!$D$5-Outcome!$F$5)+(Outcome!$D$4-Outcome!$F$4)","v":0},{"$f":"Outcome!$D$8 - Outcome!$F$8","v":0},{"$error":"#DIV/0!"},{"$error":"#VALUE!"},{"$f":"VLOOKUP(J32,'GEST 2.0'!$A$1:$O$45,15,FALSE)*Input!$G$28*-1","v":{"$error":"#VALUE!"}},{"$error":"#VALUE!"},{"$error":"#VALUE!"},{"$error":"#VALUE!"},{"$f":"VLOOKUP(N32,'GEST 2.0'!$A$1:$O$45,15,FALSE)*Input!$G$28*-1","v":{"$error":"#VALUE!"}},{"$error":"#VALUE!"}]
[30,{"$f":"Outcome!$D$10","v":{"$error":"#DIV/0!"}},{"$f":"VLOOKUP('DATA '!$C$43,'DATA '!$B$19:$C$40,2,FALSE)","v":"Choose your vegetation class"},{"$f":"Outcome!$F$10","v":{"$error":"#DIV/0!"}},{"$f":"VLOOKUP('DATA '!$C$71,'DATA '!$B$47:$C$69,2,FALSE)","v":"Choose your vegetation class"},{"$f":"(Outcome!$D$6-Outcome!$F$6)+(Outcome!$D$7-Outcome!$F$7)+(Outcome!$D$9-Outcome!$F$9)","v":{"$error":"#DIV/0!"}},{"$f":"(Outcome!$D$5-Outcome!$F$5)+(Outcome!$D$4-Outcome!$F$4)","v":0},{"$f":"Outcome!$D$8 - Outcome!$F$8","v":0},{"$error":"#DIV/0!"},{"$error":"#VALUE!"},{"$f":"VLOOKUP(J33,'GEST 2.0'!$A$1:$O$45,15,FALSE)*Input!$G$28*-1","v":{"$error":"#VALUE!"}},{"$error":"#VALUE!"},{"$error":"#VALUE!"},{"$error":"#VALUE!"},{"$f":"VLOOKUP(N33,'GEST 2.0'!$A$1:$O$45,15,FALSE)*Input!$G$28*-1","v":{"$error":"#VALUE!"}},{"$error":"#VALUE!"}]
[31,{"$f":"Outcome!$D$10","v":{"$error":"#DIV/0!"}},{"$f":"VLOOKUP('DATA '!$C$43,'DATA '!$B$19:$C$40,2,FALSE)","v":"Choose your vegetation class"},{"$f":"Outcome!$F$10","v":{"$error":"#DIV/0!"}},{"$f":"VLOOKUP('DATA '!$C$71,'DATA '!$B$47:$C$69,2,FALSE)","v":"Choose your vegetation class"},{"$f":"(Outcome!$D$6-Outcome!$F$6)+(Outcome!$D$7-Outcome!$F$7)+(Outcome!$D$9-Outcome!$F$9)","v":{"$error":"#DIV/0!"}},{"$f":"(Outcome!$D$5-Outcome!$F$5)+(Outcome!$D$4-Outcome!$F$4)","v":0},{"$f":"Outcome!$D$8 - Outcome!$F$8","v":0},{"$error":"#DIV/0!"},{"$error":"#VALUE!"},{"$f":"VLOOKUP(J34,'GEST 2.0'!$A$1:$O$45,15,FALSE)*Input!$G$28*-1","v":{"$error":"#VALUE!"}},{"$error":"#VALUE!"},{"$error":"#VALUE!"},{"$error":"#VALUE!"},{"$f":"VLOOKUP(N34,'GEST 2.0'!$A$1:$O$45,15,FALSE)*Input!$G$28*-1","v":{"$error":"#VALUE!"}},{"$error":"#VALUE!"}]
[32,{"$f":"Outcome!$D$10","v":{"$error":"#DIV/0!"}},{"$f":"VLOOKUP('DATA '!$C$43,'DATA '!$B$19:$C$40,2,FALSE)","v":"Choose your vegetation class"},{"$f":"Outcome!$F$10","v":{"$error":"#DIV/0!"}},{"$f":"VLOOKUP('DATA '!$C$71,'DATA '!$B$47:$C$69,2,FALSE)","v":"Choose your vegetation class"},{"$f":"(Outcome!$D$6-Outcome!$F$6)+(Outcome!$D$7-Outcome!$F$7)+(Outcome!$D$9-Outcome!$F$9)","v":{"$error":"#DIV/0!"}},{"$f":"(Outcome!$D$5-Outcome!$F$5)+(Outcome!$D$4-Outcome!$F$4)","v":0},{"$f":"Outcome!$D$8 - Outcome!$F$8","v":0},{"$error":"#DIV/0!"},{"$f":"LEFT(C35, FIND(\":\",C35)-1)","v":{"$error":"#VALUE!"}},{"$f":"VLOOKUP(J35,'GEST 2.0'!$A$1:$O$45,15,FALSE)*Input!$G$28*-1","v":{"$error":"#VALUE!"}},{"$error":"#VALUE!"},{"$error":"#VALUE!"},{"$error":"#VALUE!"},{"$f":"VLOOKUP(N35,'GEST 2.0'!$A$1:$O$45,15,FALSE)*Input!$G$28*-1","v":{"$error":"#VALUE!"}},{"$error":"#VALUE!"}]
[33,{"$f":"Outcome!$D$10","v":{"$error":"#DIV/0!"}},{"$f":"VLOOKUP('DATA '!$C$43,'DATA '!$B$19:$C$40,2,FALSE)","v":"Choose your vegetation class"},{"$f":"Outcome!$F$10","v":{"$error":"#DIV/0!"}},{"$f":"VLOOKUP('DATA '!$C$71,'DATA '!$B$47:$C$69,2,FALSE)","v":"Choose your vegetation class"},{"$f":"(Outcome!$D$6-Outcome!$F$6)+(Outcome!$D$7-Outcome!$F$7)+(Outcome!$D$9-Outcome!$F$9)","v":{"$error":"#DIV/0!"}},{"$f":"(Outcome!$D$5-Outcome!$F$5)+(Outcome!$D$4-Outcome!$F$4)","v":0},{"$f":"Outcome!$D$8 - Outcome!$F$8","v":0},{"$error":"#DIV/0!"},{"$error":"#VALUE!"},{"$f":"VLOOKUP(J36,'GEST 2.0'!$A$1:$O$45,15,FALSE)*Input!$G$28*-1","v":{"$error":"#VALUE!"}},{"$error":"#VALUE!"},{"$error":"#VALUE!"},{"$error":"#VALUE!"},{"$f":"VLOOKUP(N36,'GEST 2.0'!$A$1:$O$45,15,FALSE)*Input!$G$28*-1","v":{"$error":"#VALUE!"}},{"$error":"#VALUE!"}]
[34,{"$f":"Outcome!$D$10","v":{"$error":"#DIV/0!"}},{"$f":"VLOOKUP('DATA '!$C$43,'DATA '!$B$19:$C$40,2,FALSE)","v":"Choose your vegetation class"},{"$f":"Outcome!$F$10","v":{"$error":"#DIV/0!"}},{"$f":"VLOOKUP('DATA '!$C$71,'DATA '!$B$47:$C$69,2,FALSE)","v":"Choose your vegetation class"},{"$f":"(Outcome!$D$6-Outcome!$F$6)+(Outcome!$D$7-Outcome!$F$7)+(Outcome!$D$9-Outcome!$F$9)","v":{"$error":"#DIV/0!"}},{"$f":"(Outcome!$D$5-Outcome!$F$5)+(Outcome!$D$4-Outcome!$F$4)","v":0},{"$f":"Outcome!$D$8 - Outcome!$F$8","v":0},{"$error":"#DIV/0!"},{"$error":"#VALUE!"},{"$f":"VLOOKUP(J37,'GEST 2.0'!$A$1:$O$45,15,FALSE)*Input!$G$28*-1","v":{"$error":"#VALUE!"}},{"$error":"#VALUE!"},{"$error":"#VALUE!"},{"$error":"#VALUE!"},{"$f":"VLOOKUP(N37,'GEST 2.0'!$A$1:$O$45,15,FALSE)*Input!$G$28*-1","v":{"$error":"#VALUE!"}},{"$error":"#VALUE!"}]
[35,{"$f":"Outcome!$D$10","v":{"$error":"#DIV/0!"}},{"$f":"VLOOKUP('DATA '!$C$43,'DATA '!$B$19:$C$40,2,FALSE)","v":"Choose your vegetation class"},{"$f":"Outcome!$F$10","v":{"$error":"#DIV/0!"}},{"$f":"VLOOKUP('DATA '!$C$71,'DATA '!$B$47:$C$69,2,FALSE)","v":"Choose your vegetation class"},{"$f":"(Outcome!$D$6-Outcome!$F$6)+(Outcome!$D$7-Outcome!$F$7)+(Outcome!$D$9-Outcome!$F$9)","v":{"$error":"#DIV/0!"}},{"$f":"(Outcome!$D$5-Outcome!$F$5)+(Outcome!$D$4-Outcome!$F$4)","v":0},{"$f":"Outcome!$D$8 - Outcome!$F$8","v":0},{"$error":"#DIV/0!"},{"$error":"#VALUE!"},{"$f":"VLOOKUP(J38,'GEST 2.0'!$A$1:$O$45,15,FALSE)*Input!$G$28*-1","v":{"$error":"#VALUE!"}},{"$error":"#VALUE!"},{"$error":"#VALUE!"},{"$error":"#VALUE!"},{"$f":"VLOOKUP(N38,'GEST 2.0'!$A$1:$O$45,15,FALSE)*Input!$G$28*-1","v":{"$error":"#VALUE!"}},{"$error":"#VALUE!"}]
[36,{"$f":"Outcome!$D$10","v":{"$error":"#DIV/0!"}},{"$f":"VLOOKUP('DATA '!$C$43,'DATA '!$B$19:$C$40,2,FALSE)","v":"Choose your vegetation class"},{"$f":"Outcome!$F$10","v":{"$error":"#DIV/0!"}},{"$f":"VLOOKUP('DATA '!$C$71,'DATA '!$B$47:$C$69,2,FALSE)","v":"Choose your vegetation class"},{"$f":"(Outcome!$D$6-Outcome!$F$6)+(Outcome!$D$7-Outcome!$F$7)+(Outcome!$D$9-Outcome!$F$9)","v":{"$error":"#DIV/0!"}},{"$f":"(Outcome!$D$5-Outcome!$F$5)+(Outcome!$D$4-Outcome!$F$4)","v":0},{"$f":"Outcome!$D$8 - Outcome!$F$8","v":0},{"$error":"#DIV/0!"},{"$error":"#VALUE!"},{"$f":"VLOOKUP(J39,'GEST 2.0'!$A$1:$O$45,15,FALSE)*Input!$G$28*-1","v":{"$error":"#VALUE!"}},{"$error":"#VALUE!"},{"$error":"#VALUE!"},{"$error":"#VALUE!"},{"$f":"VLOOKUP(N39,'GEST 2.0'!$A$1:$O$45,15,FALSE)*Input!$G$28*-1","v":{"$error":"#VALUE!"}},{"$error":"#VALUE!"}]
[37,{"$f":"Outcome!$D$10","v":{"$error":"#DIV/0!"}},{"$f":"VLOOKUP('DATA '!$C$43,'DATA '!$B$19:$C$40,2,FALSE)","v":"Choose your vegetation class"},{"$f":"Outcome!$F$10","v":{"$error":"#DIV/0!"}},{"$f":"VLOOKUP('DATA '!$C$71,'DATA '!$B$47:$C$69,2,FALSE)","v":"Choose your vegetation class"},{"$f":"(Outcome!$D$6-Outcome!$F$6)+(Outcome!$D$7-Outcome!$F$7)+(Outcome!$D$9-Outcome!$F$9)","v":{"$error":"#DIV/0!"}},{"$f":"(Outcome!$D$5-Outcome!$F$5)+(Outcome!$D$4-Outcome!$F$4)","v":0},{"$f":"Outcome!$D$8 - Outcome!$F$8","v":0},{"$error":"#DIV/0!"},{"$error":"#VALUE!"},{"$f":"VLOOKUP(J40,'GEST 2.0'!$A$1:$O$45,15,FALSE)*Input!$G$28*-1","v":{"$error":"#VALUE!"}},{"$error":"#VALUE!"},{"$error":"#VALUE!"},{"$error":"#VALUE!"},{"$f":"VLOOKUP(N40,'GEST 2.0'!$A$1:$O$45,15,FALSE)*Input!$G$28*-1","v":{"$error":"#VALUE!"}},{"$error":"#VALUE!"}]
[38,{"$f":"Outcome!$D$10","v":{"$error":"#DIV/0!"}},{"$f":"VLOOKUP('DATA '!$C$43,'DATA '!$B$19:$C$40,2,FALSE)","v":"Choose your vegetation class"},{"$f":"Outcome!$F$10","v":{"$error":"#DIV/0!"}},{"$f":"VLOOKUP('DATA '!$C$71,'DATA '!$B$47:$C$69,2,FALSE)","v":"Choose your vegetation class"},{"$f":"(Outcome!$D$6-Outcome!$F$6)+(Outcome!$D$7-Outcome!$F$7)+(Outcome!$D$9-Outcome!$F$9)","v":{"$error":"#DIV/0!"}},{"$f":"(Outcome!$D$5-Outcome!$F$5)+(Outcome!$D$4-Outcome!$F$4)","v":0},{"$f":"Outcome!$D$8 - Outcome!$F$8","v":0},{"$error":"#DIV/0!"},{"$error":"#VALUE!"},{"$f":"VLOOKUP(J41,'GEST 2.0'!$A$1:$O$45,15,FALSE)*Input!$G$28*-1","v":{"$error":"#VALUE!"}},{"$error":"#VALUE!"},{"$error":"#VALUE!"},{"$error":"#VALUE!"},{"$f":"VLOOKUP(N41,'GEST 2.0'!$A$1:$O$45,15,FALSE)*Input!$G$28*-1","v":{"$error":"#VALUE!"}},{"$error":"#VALUE!"}]
[39,{"$f":"Outcome!$D$10","v":{"$error":"#DIV/0!"}},{"$f":"VLOOKUP('DATA '!$C$43,'DATA '!$B$19:$C$40,2,FALSE)","v":"Choose your vegetation class"},{"$f":"Outcome!$F$10","v":{"$error":"#DIV/0!"}},{"$f":"VLOOKUP('DATA '!$C$71,'DATA '!$B$47:$C$69,2,FALSE)","v":"Choose your vegetation class"},{"$f":"(Outcome!$D$6-Outcome!$F$6)+(Outcome!$D$7-Outcome!$F$7)+(Outcome!$D$9-Outcome!$F$9)","v":{"$error":"#DIV/0!"}},{"$f":"(Outcome!$D$5-Outcome!$F$5)+(Outcome!$D$4-Outcome!$F$4)","v":0},{"$f":"Outcome!$D$8 - Outcome!$F$8","v":0},{"$error":"#DIV/0!"},{"$error":"#VALUE!"},{"$f":"VLOOKUP(J42,'GEST 2.0'!$A$1:$O$45,15,FALSE)*Input!$G$28*-1","v":{"$error":"#VALUE!"}},{"$error":"#VALUE!"},{"$error":"#VALUE!"},{"$error":"#VALUE!"},{"$f":"VLOOKUP(N42,'GEST 2.0'!$A$1:$O$45,15,FALSE)*Input!$G$28*-1","v":{"$error":"#VALUE!"}},{"$error":"#VALUE!"}]
[40,{"$f":"Outcome!$D$10","v":{"$error":"#DIV/0!"}},{"$f":"VLOOKUP('DATA '!$C$43,'DATA '!$B$19:$C$40,2,FALSE)","v":"Choose your vegetation class"},{"$f":"Outcome!$F$10","v":{"$error":"#DIV/0!"}},{"$f":"VLOOKUP('DATA '!$C$71,'DATA '!$B$47:$C$69,2,FALSE)","v":"Choose your vegetation class"},{"$f":"(Outcome!$D$6-Outcome!$F$6)+(Outcome!$D$7-Outcome!$F$7)+(Outcome!$D$9-Outcome!$F$9)","v":{"$error":"#DIV/0!"}},{"$f":"(Outcome!$D$5-Outcome!$F$5)+(Outcome!$D$4-Outcome!$F$4)","v":0},{"$f":"Outcome!$D$8 - Outcome!$F$8","v":0},{"$error":"#DIV/0!"},{"$error":"#VALUE!"},{"$f":"VLOOKUP(J43,'GEST 2.0'!$A$1:$O$45,15,FALSE)*Input!$G$28*-1","v":{"$error":"#VALUE!"}},{"$error":"#VALUE!"},{"$error":"#VALUE!"},{"$error":"#VALUE!"},{"$f":"VLOOKUP(N43,'GEST 2.0'!$A$1:$O$45,15,FALSE)*Input!$G$28*-1","v":{"$error":"#VALUE!"}},{"$error":"#VALUE!"}]
[41,{"$f":"Outcome!$D$10","v":{"$error":"#DIV/0!"}},{"$f":"VLOOKUP('DATA '!$C$43,'DATA '!$B$19:$C$40,2,FALSE)","v":"Choose your vegetation class"},{"$f":"Outcome!$F$10","v":{"$error":"#DIV/0!"}},{"$f":"VLOOKUP('DATA '!$C$71,'DATA '!$B$47:$C$69,2,FALSE)","v":"Choose your vegetation class"},{"$f":"(Outcome!$D$6-Outcome!$F$6)+(Outcome!$D$7-Outcome!$F$7)+(Outcome!$D$9-Outcome!$F$9)","v":{"$error":"#DIV/0!"}},{"$f":"(Outcome!$D$5-Outcome!$F$5)+(Outcome!$D$4-Outcome!$F$4)","v":0},{"$f":"Outcome!$D$8 - Outcome!$F$8","v":0},{"$error":"#DIV/0!"},{"$error":"#VALUE!"},{"$f":"VLOOKUP(J44,'GEST 2.0'!$A$1:$O$45,15,FALSE)*Input!$G$28*-1","v":{"$error":"#VALUE!"}},{"$error":"#VALUE!"},{"$error":"#VALUE!"},{"$error":"#VALUE!"},{"$f":"VLOOKUP(N44,'GEST 2.0'!$A$1:$O$45,15,FALSE)*Input!$G$28*-1","v":{"$error":"#VALUE!"}},{"$error":"#VALUE!"}]
[42,{"$f":"Outcome!$D$10","v":{"$error":"#DIV/0!"}},{"$f":"VLOOKUP('DATA '!$C$43,'DATA '!$B$19:$C$40,2,FALSE)","v":"Choose your vegetation class"},{"$f":"Outcome!$F$10","v":{"$error":"#DIV/0!"}},{"$f":"VLOOKUP('DATA '!$C$71,'DATA '!$B$47:$C$69,2,FALSE)","v":"Choose your vegetation class"},{"$f":"(Outcome!$D$6-Outcome!$F$6)+(Outcome!$D$7-Outcome!$F$7)+(Outcome!$D$9-Outcome!$F$9)","v":{"$error":"#DIV/0!"}},{"$f":"(Outcome!$D$5-Outcome!$F$5)+(Outcome!$D$4-Outcome!$F$4)","v":0},{"$f":"Outcome!$D$8 - Outcome!$F$8","v":0},{"$error":"#DIV/0!"},{"$error":"#VALUE!"},{"$f":"VLOOKUP(J45,'GEST 2.0'!$A$1:$O$45,15,FALSE)*Input!$G$28*-1","v":{"$error":"#VALUE!"}},{"$error":"#VALUE!"},{"$error":"#VALUE!"},{"$error":"#VALUE!"},{"$f":"VLOOKUP(N45,'GEST 2.0'!$A$1:$O$45,15,FALSE)*Input!$G$28*-1","v":{"$error":"#VALUE!"}},{"$error":"#VALUE!"}]
[43,{"$f":"Outcome!$D$10","v":{"$error":"#DIV/0!"}},{"$f":"VLOOKUP('DATA '!$C$43,'DATA '!$B$19:$C$40,2,FALSE)","v":"Choose your vegetation class"},{"$f":"Outcome!$F$10","v":{"$error":"#DIV/0!"}},{"$f":"VLOOKUP('DATA '!$C$71,'DATA '!$B$47:$C$69,2,FALSE)","v":"Choose your vegetation class"},{"$f":"(Outcome!$D$6-Outcome!$F$6)+(Outcome!$D$7-Outcome!$F$7)+(Outcome!$D$9-Outcome!$F$9)","v":{"$error":"#DIV/0!"}},{"$f":"(Outcome!$D$5-Outcome!$F$5)+(Outcome!$D$4-Outcome!$F$4)","v":0},{"$f":"Outcome!$D$8 - Outcome!$F$8","v":0},{"$error":"#DIV/0!"},{"$error":"#VALUE!"},{"$f":"VLOOKUP(J46,'GEST 2.0'!$A$1:$O$45,15,FALSE)*Input!$G$28*-1","v":{"$error":"#VALUE!"}},{"$error":"#VALUE!"},{"$error":"#VALUE!"},{"$error":"#VALUE!"},{"$f":"VLOOKUP(N46,'GEST 2.0'!$A$1:$O$45,15,FALSE)*Input!$G$28*-1","v":{"$error":"#VALUE!"}},{"$error":"#VALUE!"}]
[44,{"$f":"Outcome!$D$10","v":{"$error":"#DIV/0!"}},{"$f":"VLOOKUP('DATA '!$C$43,'DATA '!$B$19:$C$40,2,FALSE)","v":"Choose your vegetation class"},{"$f":"Outcome!$F$10","v":{"$error":"#DIV/0!"}},{"$f":"VLOOKUP('DATA '!$C$71,'DATA '!$B$47:$C$69,2,FALSE)","v":"Choose your vegetation class"},{"$f":"(Outcome!$D$6-Outcome!$F$6)+(Outcome!$D$7-Outcome!$F$7)+(Outcome!$D$9-Outcome!$F$9)","v":{"$error":"#DIV/0!"}},{"$f":"(Outcome!$D$5-Outcome!$F$5)+(Outcome!$D$4-Outcome!$F$4)","v":0},{"$f":"Outcome!$D$8 - Outcome!$F$8","v":0},{"$error":"#DIV/0!"},{"$error":"#VALUE!"},{"$f":"VLOOKUP(J47,'GEST 2.0'!$A$1:$O$45,15,FALSE)*Input!$G$28*-1","v":{"$error":"#VALUE!"}},{"$error":"#VALUE!"},{"$error":"#VALUE!"},{"$error":"#VALUE!"},{"$f":"VLOOKUP(N47,'GEST 2.0'!$A$1:$O$45,15,FALSE)*Input!$G$28*-1","v":{"$error":"#VALUE!"}},{"$error":"#VALUE!"}]
[45,{"$f":"Outcome!$D$10","v":{"$error":"#DIV/0!"}},{"$f":"VLOOKUP('DATA '!$C$43,'DATA '!$B$19:$C$40,2,FALSE)","v":"Choose your vegetation class"},{"$f":"Outcome!$F$10","v":{"$error":"#DIV/0!"}},{"$f":"VLOOKUP('DATA '!$C$71,'DATA '!$B$47:$C$69,2,FALSE)","v":"Choose your vegetation class"},{"$f":"(Outcome!$D$6-Outcome!$F$6)+(Outcome!$D$7-Outcome!$F$7)+(Outcome!$D$9-Outcome!$F$9)","v":{"$error":"#DIV/0!"}},{"$f":"(Outcome!$D$5-Outcome!$F$5)+(Outcome!$D$4-Outcome!$F$4)","v":0},{"$f":"Outcome!$D$8 - Outcome!$F$8","v":0},{"$error":"#DIV/0!"},{"$error":"#VALUE!"},{"$f":"VLOOKUP(J48,'GEST 2.0'!$A$1:$O$45,15,FALSE)*Input!$G$28*-1","v":{"$error":"#VALUE!"}},{"$error":"#VALUE!"},{"$error":"#VALUE!"},{"$error":"#VALUE!"},{"$f":"VLOOKUP(N48,'GEST 2.0'!$A$1:$O$45,15,FALSE)*Input!$G$28*-1","v":{"$error":"#VALUE!"}},{"$error":"#VALUE!"}]
[46,{"$f":"Outcome!$D$10","v":{"$error":"#DIV/0!"}},{"$f":"VLOOKUP('DATA '!$C$43,'DATA '!$B$19:$C$40,2,FALSE)","v":"Choose your vegetation class"},{"$f":"Outcome!$F$10","v":{"$error":"#DIV/0!"}},{"$f":"VLOOKUP('DATA '!$C$71,'DATA '!$B$47:$C$69,2,FALSE)","v":"Choose your vegetation class"},{"$f":"(Outcome!$D$6-Outcome!$F$6)+(Outcome!$D$7-Outcome!$F$7)+(Outcome!$D$9-Outcome!$F$9)","v":{"$error":"#DIV/0!"}},{"$f":"(Outcome!$D$5-Outcome!$F$5)+(Outcome!$D$4-Outcome!$F$4)","v":0},{"$f":"Outcome!$D$8 - Outcome!$F$8","v":0},{"$error":"#DIV/0!"},{"$error":"#VALUE!"},{"$f":"VLOOKUP(J49,'GEST 2.0'!$A$1:$O$45,15,FALSE)*Input!$G$28*-1","v":{"$error":"#VALUE!"}},{"$error":"#VALUE!"},{"$error":"#VALUE!"},{"$error":"#VALUE!"},{"$f":"VLOOKUP(N49,'GEST 2.0'!$A$1:$O$45,15,FALSE)*Input!$G$28*-1","v":{"$error":"#VALUE!"}},{"$error":"#VALUE!"}]
[47,{"$f":"Outcome!$D$10","v":{"$error":"#DIV/0!"}},{"$f":"VLOOKUP('DATA '!$C$43,'DATA '!$B$19:$C$40,2,FALSE)","v":"Choose your vegetation class"},{"$f":"Outcome!$F$10","v":{"$error":"#DIV/0!"}},{"$f":"VLOOKUP('DATA '!$C$71,'DATA '!$B$47:$C$69,2,FALSE)","v":"Choose your vegetation class"},{"$f":"(Outcome!$D$6-Outcome!$F$6)+(Outcome!$D$7-Outcome!$F$7)+(Outcome!$D$9-Outcome!$F$9)","v":{"$error":"#DIV/0!"}},{"$f":"(Outcome!$D$5-Outcome!$F$5)+(Outcome!$D$4-Outcome!$F$4)","v":0},{"$f":"Outcome!$D$8 - Outcome!$F$8","v":0},{"$error":"#DIV/0!"},{"$error":"#VALUE!"},{"$f":"VLOOKUP(J50,'GEST 2.0'!$A$1:$O$45,15,FALSE)*Input!$G$28*-1","v":{"$error":"#VALUE!"}},{"$error":"#VALUE!"},{"$error":"#VALUE!"},{"$error":"#VALUE!"},{"$f":"VLOOKUP(N50,'GEST 2.0'!$A$1:$O$45,15,FALSE)*Input!$G$28*-1","v":{"$error":"#VALUE!"}},{"$error":"#VALUE!"}]
[48,{"$f":"Outcome!$D$10","v":{"$error":"#DIV/0!"}},{"$f":"VLOOKUP('DATA '!$C$43,'DATA '!$B$19:$C$40,2,FALSE)","v":"Choose your vegetation class"},{"$f":"Outcome!$F$10","v":{"$error":"#DIV/0!"}},{"$f":"VLOOKUP('DATA '!$C$71,'DATA '!$B$47:$C$69,2,FALSE)","v":"Choose your vegetation class"},{"$f":"(Outcome!$D$6-Outcome!$F$6)+(Outcome!$D$7-Outcome!$F$7)+(Outcome!$D$9-Outcome!$F$9)","v":{"$error":"#DIV/0!"}},{"$f":"(Outcome!$D$5-Outcome!$F$5)+(Outcome!$D$4-Outcome!$F$4)","v":0},{"$f":"Outcome!$D$8 - Outcome!$F$8","v":0},{"$error":"#DIV/0!"},{"$error":"#VALUE!"},{"$f":"VLOOKUP(J51,'GEST 2.0'!$A$1:$O$45,15,FALSE)*Input!$G$28*-1","v":{"$error":"#VALUE!"}},{"$error":"#VALUE!"},{"$error":"#VALUE!"},{"$error":"#VALUE!"},{"$f":"VLOOKUP(N51,'GEST 2.0'!$A$1:$O$45,15,FALSE)*Input!$G$28*-1","v":{"$error":"#VALUE!"}},{"$error":"#VALUE!"}]
[49,{"$f":"Outcome!$D$10","v":{"$error":"#DIV/0!"}},{"$f":"VLOOKUP('DATA '!$C$43,'DATA '!$B$19:$C$40,2,FALSE)","v":"Choose your vegetation class"},{"$f":"Outcome!$F$10","v":{"$error":"#DIV/0!"}},{"$f":"VLOOKUP('DATA '!$C$71,'DATA '!$B$47:$C$69,2,FALSE)","v":"Choose your vegetation class"},{"$f":"(Outcome!$D$6-Outcome!$F$6)+(Outcome!$D$7-Outcome!$F$7)+(Outcome!$D$9-Outcome!$F$9)","v":{"$error":"#DIV/0!"}},{"$f":"(Outcome!$D$5-Outcome!$F$5)+(Outcome!$D$4-Outcome!$F$4)","v":0},{"$f":"Outcome!$D$8 - Outcome!$F$8","v":0},{"$error":"#DIV/0!"},{"$error":"#VALUE!"},{"$f":"VLOOKUP(J52,'GEST 2.0'!$A$1:$O$45,15,FALSE)*Input!$G$28*-1","v":{"$error":"#VALUE!"}},{"$error":"#VALUE!"},{"$error":"#VALUE!"},{"$error":"#VALUE!"},{"$f":"VLOOKUP(N52,'GEST 2.0'!$A$1:$O$45,15,FALSE)*Input!$G$28*-1","v":{"$error":"#VALUE!"}},{"$error":"#VALUE!"}]

{"sheet":"DATA ","index":4,"n_rows":106,"n_cols":13,"rows_kept":106,"cut":false,"hidden":true,"merged":[[16,5,16,6],[16,7,16,8],[44,5,44,6],[44,7,44,8]]}
[]
[null,null,"Soilmoisture"]
[null,1,{"$f":"CONCATENATE('soil moisture classes '!A3,'soil moisture classes '!L3,'soil moisture classes '!B3)","v":"7+Upper sublitoral"}]
[null,2,{"$f":"CONCATENATE('soil moisture classes '!A4,'soil moisture classes '!L4,'soil moisture classes '!B4)","v":"6+Flooded (lower eulittoral)"}]
[null,3,{"$f":"CONCATENATE('soil moisture classes '!A5,'soil moisture classes '!L5,'soil moisture classes '!B5)","v":"5+Wet (upper eulittoral)"}]
[null,4,{"$f":"CONCATENATE('soil moisture classes '!A6,'soil moisture classes '!L6,'soil moisture classes '!B6)","v":"4+Semi wet (very moist)"}]
[null,5,{"$f":"CONCATENATE('soil moisture classes '!A7,'soil moisture classes '!L7,'soil moisture classes '!B7)","v":"3+moist"}]
[null,6,{"$f":"CONCATENATE('soil moisture classes '!A8,'soil moisture classes '!L8,'soil moisture classes '!B8)","v":"2+Moderate moist"}]
[null,7,{"$f":"CONCATENATE('soil moisture classes '!A9,'soil moisture classes '!L9,'soil moisture classes '!B9)","v":"2-Moderate dry"}]
[null,8,{"$f":"CONCATENATE('soil moisture classes '!A10,'soil moisture classes '!L10,'soil moisture classes '!B10)","v":"3-Dry"}]
[null,9,{"$f":"CONCATENATE('soil moisture classes '!A11,'soil moisture classes '!L11,'soil moisture classes '!B11)","v":"4-Very dry"}]
[null,10,{"$f":"CONCATENATE('soil moisture classes '!A12,'soil moisture classes '!L12,'soil moisture classes '!B12)","v":"5-Extremely dry"}]
[]
[null,"output baseline",7]
[null,"output rewetting",5]
[]
[null,null,null,null,null,"CH4",null,"CO2",null,"Total C-flux"]
[null,null,null,null,null,"GWP","n","GWP","n","GWP","baseline"]
[null,"Baseline","Vegetation",null,null,null,null,null,null,null,"CH4","CO2","Total GWP"]
[null,1,"Choose your vegetation class"]
[null,2,{"$f":"'GEST 2.0'!P71","v":"U17: Very wet tall sedges and Typha"},null,null,{"$f":"'GEST 2.0'!Q71","v":6.81},{"$f":"'GEST 2.0'!R71","v":8},{"$f":"'GEST 2.0'!S71","v":-1.08},{"$f":"'GEST 2.0'!T71","v":8},{"$f":"'GEST 2.0'!U71","v":5.5},{"$f":"IF($C$43=B21,F21,0)","v":0},{"$f":"IF($C$43=B21,H21,0)","v":0},{"$f":"IF($C$43=B21,J21,0)","v":0}]
[null,3,{"$f":"'GEST 2.0'!P72","v":"U18: Very wet Phragmites reeds"},null,null,{"$f":"'GEST 2.0'!Q72","v":12.44},{"$f":"'GEST 2.0'!R72","v":12},{"$f":"'GEST 2.0'!S72","v":-12.38},{"$f":"'GEST 2.0'!T72","v":8},{"$f":"'GEST 2.0'!U72","v":0},0,0,0]
[null,4,{"$f":"'GEST 2.0'!P73","v":"U19: Wet to very wet Sphagnum hollows"},null,null,{"$f":"'GEST 2.0'!Q73","v":11.81},{"$f":"'GEST 2.0'!R73","v":8},{"$f":"'GEST 2.0'!S73","v":-4.58},{"$f":"'GEST 2.0'!T73","v":8},{"$f":"'GEST 2.0'!U73","v":7},0,0,0]
[null,5,{"$f":"'GEST 2.0'!P74","v":"U20: Flooded tall reeds (> 20 cm above surface)"},null,null,{"$f":"'GEST 2.0'!Q74","v":28.29},{"$f":"'GEST 2.0'!R74","v":30},{"$f":"'GEST 2.0'!S74","v":-32.74},{"$f":"'GEST 2.0'!T74","v":6},{"$f":"'GEST 2.0'!U74","v":-4.5},0,0,0]
[null,6,{"$f":"'GEST 2.0'!P75","v":"S8: Very wet reeds with lateral import of organic matter"},null,null,{"$f":"'GEST 2.0'!Q75","v":42.27},{"$f":"'GEST 2.0'!R75","v":18},{"$f":"'GEST 2.0'!S75","v":2.39},{"$f":"'GEST 2.0'!T75","v":18},{"$f":"'GEST 2.0'!U75","v":44.5},0,0,0]
[null,7,{"$f":"'GEST 2.0'!P76","v":"S9: Ditches in low intensity grassland"},null,null,{"$f":"'GEST 2.0'!Q76","v":3.17},{"$f":"'GEST 2.0'!R76","v":3},{"$f":"'GEST 2.0'!S76","v":"+/- 0"},{"$f":"'GEST 2.0'!T76","v":"-"},{"$f":"'GEST 2.0'!U76","v":3},0,0,0]
[null,8,{"$f":"'GEST 2.0'!P77","v":"."},null,null,{"$f":"'GEST 2.0'!Q77","v":"."},{"$f":"'GEST 2.0'!R77","v":"."},{"$f":"'GEST 2.0'!S77","v":"."},{"$f":"'GEST 2.0'!T77","v":"."},{"$f":"'GEST 2.0'!U77","v":"."},0,0,0]
[null,9,{"$f":"'GEST 2.0'!P78","v":"."},null,null,{"$f":"'GEST 2.0'!Q78","v":"."},{"$f":"'GEST 2.0'!R78","v":"."},{"$f":"'GEST 2.0'!S78","v":"."},{"$f":"'GEST 2.0'!T78","v":"."},{"$f":"'GEST 2.0'!U78","v":"."},0,0,0]
[null,10,{"$f":"'GEST 2.0'!P79","v":"."},null,null,{"$f":"'GEST 2.0'!Q79","v":"."},{"$f":"'GEST 2.0'!R79","v":"."},{"$f":"'GEST 2.0'!S79","v":"."},{"$f":"'GEST 2.0'!T79","v":"."},{"$f":"'GEST 2.0'!U79","v":"."},0,0,0]
[null,11,{"$f":"'GEST 2.0'!P80","v":"."},null,null,{"$f":"'GEST 2.0'!Q80","v":"."},{"$f":"'GEST 2.0'!R80","v":"."},{"$f":"'GEST 2.0'!S80","v":"."},{"$f":"'GEST 2.0'!T80","v":"."},{"$f":"'GEST 2.0'!U80","v":"."},0,0,0]
[null,12,{"$f":"'GEST 2.0'!P81","v":"."},null,null,{"$f":"'GEST 2.0'!Q81","v":"."},{"$f":"'GEST 2.0'!R81","v":"."},{"$f":"'GEST 2.0'!S81","v":"."},{"$f":"'GEST 2.0'!T81","v":"."},{"$f":"'GEST 2.0'!U81","v":"."},0,0,0]
[null,13,{"$f":"'GEST 2.0'!P82","v":"."},null,null,{"$f":"'GEST 2.0'!Q82","v":"."},{"$f":"'GEST 2.0'!R82","v":"."},{"$f":"'GEST 2.0'!S82","v":"."},{"$f":"'GEST 2.0'!T82","v":"."},{"$f":"'GEST 2.0'!U82","v":"."},0,0,0]
[null,14,{"$f":"'GEST 2.0'!P83","v":"."},null,null,{"$f":"'GEST 2.0'!Q83","v":"."},{"$f":"'GEST 2.0'!R83","v":"."},{"$f":"'GEST 2.0'!S83","v":"."},{"$f":"'GEST 2.0'!T83","v":"."},{"$f":"'GEST 2.0'!U83","v":"."},0,0,0]
[null,15,{"$f":"'GEST 2.0'!P84","v":"."},null,null,{"$f":"'GEST 2.0'!Q84","v":"."},{"$f":"'GEST 2.0'!R84","v":"."},{"$f":"'GEST 2.0'!S84","v":"."},{"$f":"'GEST 2.0'!T84","v":"."},{"$f":"'GEST 2.0'!U84","v":"."},0,0,0]
[null,16,{"$f":"'GEST 2.0'!P85","v":"."},null,null,{"$f":"'GEST 2.0'!Q85","v":"."},{"$f":"'GEST 2.0'!R85","v":"."},{"$f":"'GEST 2.0'!S85","v":"."},{"$f":"'GEST 2.0'!T85","v":"."},{"$f":"'GEST 2.0'!U85","v":"."},0,0,0]
[null,17,{"$f":"'GEST 2.0'!P86","v":"."},null,null,{"$f":"'GEST 2.0'!Q86","v":"."},{"$f":"'GEST 2.0'!R86","v":"."},{"$f":"'GEST 2.0'!S86","v":"."},{"$f":"'GEST 2.0'!T86","v":"."},{"$f":"'GEST 2.0'!U86","v":"."},0,0,0]
[null,18,{"$f":"'GEST 2.0'!P87","v":"."},null,null,{"$f":"'GEST 2.0'!Q87","v":"."},{"$f":"'GEST 2.0'!R87","v":"."},{"$f":"'GEST 2.0'!S87","v":"."},{"$f":"'GEST 2.0'!T87","v":"."},{"$f":"'GEST 2.0'!U87","v":"."},0,0,0]
[null,19,{"$f":"'GEST 2.0'!P88","v":"."},null,null,{"$f":"'GEST 2.0'!Q88","v":"."},{"$f":"'GEST 2.0'!R88","v":"."},{"$f":"'GEST 2.0'!S88","v":"."},{"$f":"'GEST 2.0'!T88","v":"."},{"$f":"'GEST 2.0'!U88","v":"."},0,0,0]
[null,20,{"$f":"'GEST 2.0'!P89","v":"."},null,null,{"$f":"'GEST 2.0'!Q89","v":"."},{"$f":"'GEST 2.0'!R89","v":"."},{"$f":"'GEST 2.0'!S89","v":"."},{"$f":"'GEST 2.0'!T89","v":"."},{"$f":"'GEST 2.0'!U89","v":"."},0,0,0]
[null,21,{"$f":"'GEST 2.0'!P90","v":"."},null,null,{"$f":"'GEST 2.0'!Q90","v":"."},{"$f":"'GEST 2.0'!R90","v":"."},{"$f":"'GEST 2.0'!S90","v":"."},{"$f":"'GEST 2.0'!T90","v":"."},{"$f":"'GEST 2.0'!U90","v":"."},0,0,0]
[null,22,{"$f":"'GEST 2.0'!P91","v":"."},null,null,{"$f":"'GEST 2.0'!Q91","v":"."},{"$f":"'GEST 2.0'!R91","v":"."},{"$f":"'GEST 2.0'!S91","v":"."},{"$f":"'GEST 2.0'!T91","v":"."},{"$f":"'GEST 2.0'!U91","v":"."},0,0,0]
[null,null,null,null,null,null,null,null,null,"Totaal",{"$f":"SUM(K21:K41)","v":0},{"$f":"SUM(L21:L41)","v":0},{"$f":"SUM(M21:M41)","v":0}]
[null,"output baseline",1]
[null,null,{"$f":"VLOOKUP(C43,B20:C41,2,1)","v":"Choose your vegetation class"}]
[null,null,null,null,null,"CH4",null,"CO2",null,"Total C-flux"]
[null,null,null,null,null,"GWP","n","GWP","n","GWP","rewetting"]
[null,"Rewetting","Vegetation",null,null,null,null,null,null,null,"CH4","CO2","Total GWP"]
[null,1,"Choose your vegetation class"]
[null,2,{"$f":"'GEST 2.0'!V71","v":"U17: Very wet tall sedges and Typha"},null,null,{"$f":"'GEST 2.0'!W71","v":6.81},{"$f":"'GEST 2.0'!X71","v":8},{"$f":"'GEST 2.0'!Y71","v":-1.08},{"$f":"'GEST 2.0'!Z71","v":8},{"$f":"'GEST 2.0'!AA71","v":5.5},{"$f":"IF($C$71=B49,F49,0)","v":0},{"$f":"IF($C$71=B49,H49,0)","v":0},{"$f":"IF($C$71=B49,J49,0)","v":0}]
[null,3,{"$f":"'GEST 2.0'!V72","v":"U18: Very wet Phragmites reeds"},null,null,{"$f":"'GEST 2.0'!W72","v":12.44},{"$f":"'GEST 2.0'!X72","v":12},{"$f":"'GEST 2.0'!Y72","v":-12.38},{"$f":"'GEST 2.0'!Z72","v":8},{"$f":"'GEST 2.0'!AA72","v":0},0,0,0]
[null,4,{"$f":"'GEST 2.0'!V73","v":"U19: Wet to very wet Sphagnum hollows"},null,null,{"$f":"'GEST 2.0'!W73","v":11.81},{"$f":"'GEST 2.0'!X73","v":8},{"$f":"'GEST 2.0'!Y73","v":-4.58},{"$f":"'GEST 2.0'!Z73","v":8},{"$f":"'GEST 2.0'!AA73","v":7},0,0,0]
[null,5,{"$f":"'GEST 2.0'!V74","v":"U20: Flooded tall reeds (> 20 cm above surface)"},null,null,{"$f":"'GEST 2.0'!W74","v":28.29},{"$f":"'GEST 2.0'!X74","v":30},{"$f":"'GEST 2.0'!Y74","v":-32.74},{"$f":"'GEST 2.0'!Z74","v":6},{"$f":"'GEST 2.0'!AA74","v":-4.5},0,0,0]
[null,6,{"$f":"'GEST 2.0'!V75","v":"S8: Very wet reeds with lateral import of organic matter"},null,null,{"$f":"'GEST 2.0'!W75","v":42.27},{"$f":"'GEST 2.0'!X75","v":18},{"$f":"'GEST 2.0'!Y75","v":2.39},{"$f":"'GEST 2.0'!Z75","v":18},{"$f":"'GEST 2.0'!AA75","v":44.5},0,0,0]
[null,7,{"$f":"'GEST 2.0'!V76","v":"S9: Ditches in low intensity grassland"},null,null,{"$f":"'GEST 2.0'!W76","v":3.17},{"$f":"'GEST 2.0'!X76","v":3},{"$f":"'GEST 2.0'!Y76","v":"+/- 0"},{"$f":"'GEST 2.0'!Z76","v":"-"},{"$f":"'GEST 2.0'!AA76","v":3},0,0,0]
[null,8,{"$f":"'GEST 2.0'!V77","v":"."},null,null,{"$f":"'GEST 2.0'!W77","v":"."},{"$f":"'GEST 2.0'!X77","v":"."},{"$f":"'GEST 2.0'!Y77","v":"."},{"$f":"'GEST 2.0'!Z77","v":"."},{"$f":"'GEST 2.0'!AA77","v":"."},0,0,0]
[null,9,{"$f":"'GEST 2.0'!V78","v":"."},null,null,{"$f":"'GEST 2.0'!W78","v":"."},{"$f":"'GEST 2.0'!X78","v":"."},{"$f":"'GEST 2.0'!Y78","v":"."},{"$f":"'GEST 2.0'!Z78","v":"."},{"$f":"'GEST 2.0'!AA78","v":"."},0,0,0]
[null,10,{"$f":"'GEST 2.0'!V79","v":"."},null,null,{"$f":"'GEST 2.0'!W79","v":"."},{"$f":"'GEST 2.0'!X79","v":"."},{"$f":"'GEST 2.0'!Y79","v":"."},{"$f":"'GEST 2.0'!Z79","v":"."},{"$f":"'GEST 2.0'!AA79","v":"."},0,0,0]
[null,11,{"$f":"'GEST 2.0'!V80","v":"."},null,null,{"$f":"'GEST 2.0'!W80","v":"."},{"$f":"'GEST 2.0'!X80","v":"."},{"$f":"'GEST 2.0'!Y80","v":"."},{"$f":"'GEST 2.0'!Z80","v":"."},{"$f":"'GEST 2.0'!AA80","v":"."},0,0,0]
[null,12,{"$f":"'GEST 2.0'!V81","v":"."},null,null,{"$f":"'GEST 2.0'!W81","v":"."},{"$f":"'GEST 2.0'!X81","v":"."},{"$f":"'GEST 2.0'!Y81","v":"."},{"$f":"'GEST 2.0'!Z81","v":"."},{"$f":"'GEST 2.0'!AA81","v":"."},0,0,0]
[null,13,{"$f":"'GEST 2.0'!V82","v":"."},null,null,{"$f":"'GEST 2.0'!W82","v":"."},{"$f":"'GEST 2.0'!X82","v":"."},{"$f":"'GEST 2.0'!Y82","v":"."},{"$f":"'GEST 2.0'!Z82","v":"."},{"$f":"'GEST 2.0'!AA82","v":"."},0,0,0]
[null,14,{"$f":"'GEST 2.0'!V83","v":"."},null,null,{"$f":"'GEST 2.0'!W83","v":"."},{"$f":"'GEST 2.0'!X83","v":"."},{"$f":"'GEST 2.0'!Y83","v":"."},{"$f":"'GEST 2.0'!Z83","v":"."},{"$f":"'GEST 2.0'!AA83","v":"."},0,0,0]
[null,15,{"$f":"'GEST 2.0'!V84","v":"."},null,null,{"$f":"'GEST 2.0'!W84","v":"."},{"$f":"'GEST 2.0'!X84","v":"."},{"$f":"'GEST 2.0'!Y84","v":"."},{"$f":"'GEST 2.0'!Z84","v":"."},{"$f":"'GEST 2.0'!AA84","v":"."},0,0,0]
[null,16,{"$f":"'GEST 2.0'!V85","v":"."},null,null,{"$f":"'GEST 2.0'!W85","v":"."},{"$f":"'GEST 2.0'!X85","v":"."},{"$f":"'GEST 2.0'!Y85","v":"."},{"$f":"'GEST 2.0'!Z85","v":"."},{"$f":"'GEST 2.0'!AA85","v":"."},0,0,0]
[null,17,{"$f":"'GEST 2.0'!V86","v":"."},null,null,{"$f":"'GEST 2.0'!W86","v":"."},{"$f":"'GEST 2.0'!X86","v":"."},{"$f":"'GEST 2.0'!Y86","v":"."},{"$f":"'GEST 2.0'!Z86","v":"."},{"$f":"'GEST 2.0'!AA86","v":"."},0,0,0]
[null,18,{"$f":"'GEST 2.0'!V87","v":"."},null,null,{"$f":"'GEST 2.0'!W87","v":"."},{"$f":"'GEST 2.0'!X87","v":"."},{"$f":"'GEST 2.0'!Y87","v":"."},{"$f":"'GEST 2.0'!Z87","v":"."},{"$f":"'GEST 2.0'!AA87","v":"."},0,0,0]
[null,19,{"$f":"'GEST 2.0'!V88","v":"."},null,null,{"$f":"'GEST 2.0'!W88","v":"."},{"$f":"'GEST 2.0'!X88","v":"."},{"$f":"'GEST 2.0'!Y88","v":"."},{"$f":"'GEST 2.0'!Z88","v":"."},{"$f":"'GEST 2.0'!AA88","v":"."},0,0,0]
[null,20,{"$f":"'GEST 2.0'!V89","v":"."},null,null,{"$f":"'GEST 2.0'!W89","v":"."},{"$f":"'GEST 2.0'!X89","v":"."},{"$f":"'GEST 2.0'!Y89","v":"."},{"$f":"'GEST 2.0'!Z89","v":"."},{"$f":"'GEST 2.0'!AA89","v":"."},0,0,0]
[null,21,{"$f":"'GEST 2.0'!V90","v":"."},null,null,{"$f":"'GEST 2.0'!W90","v":"."},{"$f":"'GEST 2.0'!X90","v":"."},{"$f":"'GEST 2.0'!Y90","v":"."},{"$f":"'GEST 2.0'!Z90","v":"."},{"$f":"'GEST 2.0'!AA90","v":"."},0,0,0]
[null,22,{"$f":"'GEST 2.0'!V91","v":"."},null,null,{"$f":"'GEST 2.0'!W91","v":"."},{"$f":"'GEST 2.0'!X91","v":"."},{"$f":"'GEST 2.0'!Y91","v":"."},{"$f":"'GEST 2.0'!Z91","v":"."},{"$f":"'GEST 2.0'!AA91","v":"."},0,0,0]
[null,null,null,null,null,null,null,null,null,null,{"$f":"SUM(K49:K69)","v":0},{"$f":"SUM(L49:L69)","v":0},0]
[null,"output rewetting",1]
[null,null,{"$f":"VLOOKUP(C71,B48:C69,2,1)","v":"Choose your vegetation class"}]
[]
[]
[null,null,"Grazing animals","EF","baseline","rewetting","N excretion/head/year",null,null,null,null,"N excretion/head/year"]
[null,1,"no animal"]
[null,2,"dairy cows",0.02,{"$f":"IF(C$83=$B77,D77,0)","v":0},{"$f":"IF(C$84=$B77,E77,0)","v":0},130.1,{"$f":"IF(C$83=$B77,G77,0)","v":0},{"$f":"IF(C$84=$B77,H77,0)","v":0},null,"Mature dairy cattle",130.1]
[null,3,"beef cattle",0.02,{"$f":"IF(C$83=$B78,D78,0)","v":0},{"$f":"IF(C$84=$B78,E78,0)","v":0},28.2,{"$f":"IF(C$83=$B78,G78,0)","v":0},{"$f":"IF(C$84=$B78,H78,0)","v":0},null,"Other mature cattle",77.5]
[null,4,"sheep",0.01,{"$f":"IF(C$83=$B79,D79,0)","v":0},{"$f":"IF(C$84=$B79,E79,0)","v":0},9.9,{"$f":"IF(C$83=$B79,G79,0)","v":0},{"$f":"IF(C$84=$B79,H79,0)","v":0},null,"Growing cattle",39]
[null,5,"goat",0.01,{"$f":"IF(C$83=$B80,D80,0)","v":0},{"$f":"IF(C$84=$B80,E80,0)","v":0},7.4,{"$f":"IF(C$83=$B80,G80,0)","v":0},{"$f":"IF(C$84=$B80,H80,0)","v":0}]
[null,6,"water buffalo",0.02,{"$f":"IF(C$83=$B81,D81,0)","v":0},{"$f":"IF(C$84=$B81,E81,0)","v":0},76.5,{"$f":"IF(C$83=$B81,G81,0)","v":0},{"$f":"IF(C$84=$B81,H81,0)","v":0}]
[null,null,null,null,{"$f":"SUM(E77:E81)","v":0},{"$f":"SUM(F77:F81)","v":0},null,{"$f":"SUM(H77:H81)","v":0},{"$f":"SUM(I77:I81)","v":0}]
[null,"output baseline",1]
[null,"output rewetting",1]
[]
[]
[null,null,"Fertilizer",null,null,"Ammonia EF"]
[null,1,"nitrate based",0.02,null,1.4999999999999999E-2]
[null,2,"ammonium based",0.01,null,0.1]
[]
[null,"output baseline",2]
[null,"output rewetting",1]
[]
[]
[null,null,"Crop residue"]
[null,1,"yes"]
[null,2,"no"]
[]
[null,"output baseline",2]
[null,"output rewetting",1]
[null,"crop name baseline",6]
[]
[null,"productuse rewetting",9]
[null,"crop name rewetting",6]
[]
[null,"crop residues"]

{"sheet":"Outcome","index":5,"n_rows":17,"n_cols":7,"rows_kept":17,"cut":false,"hidden":true,"merged":[]}
[]
[]
[null,null,null,"Baseline",null,"Rewetting"]
[null,null,"CH4",{"$f":"Output!G45","v":0},"CO2-eq",{"$f":"'DATA '!K70*Input!G28","v":0},"CO2-eq"]
[null,null,"CO2",{"$f":"Output!G47","v":0},"CO2-eq",{"$f":"'DATA '!L70*Input!G28","v":0},"CO2-eq"]
[null,null,"N20 direct",{"$f":"'N2O Fertilizer cattle cropresid'!C189","v":{"$error":"#DIV/0!"}},"CO2-eq",{"$f":"'N2O Fertilizer cattle cropresid'!E189","v":{"$error":"#DIV/0!"}},"CO2-eq"]
[null,null,"N20 indirect",{"$f":"'N2O Fertilizer cattle cropresid'!C236","v":{"$error":"#DIV/0!"}},"CO2-eq",{"$f":"'N2O Fertilizer cattle cropresid'!E236","v":{"$error":"#DIV/0!"}},"CO2-eq"]
[null,null,"product",null,null,{"$f":"'crop use'!F21","v":0},"CO2-eq"]
[null,null,"activity",{"$f":"'fossil energy'!D20","v":0},"CO2-eq",{"$f":"'fossil energy'!F20","v":0},"CO2-eq"]
[null,null,"total",{"$f":"SUM(D4:D9)","v":{"$error":"#DIV/0!"}},null,{"$f":"SUM(F4:F9)","v":{"$error":"#DIV/0!"}}]
[]
[]
[]
[]
[null,null,"creditable year"]
[null,null,"baseline scenario",{"$f":"('C content soil'!$E$13*Input!$G$28)/Timeline!$K$3*-1","v":{"$error":"#VALUE!"}},"year"]
[null,null,"Rewetting",{"$f":"IF(('C content soil'!$E$13*Input!$G$28)/Timeline!$O$3*-1>0,('C content soil'!$E$13*Input!$G$28)/Timeline!$O$3*-1,F17)","v":{"$error":"#VALUE!"}},"years","∞"]

{"sheet":"soil moisture classes ","index":6,"n_rows":16,"n_cols":13,"rows_kept":16,"cut":false,"hidden":true,"merged":[[0,0,0,1],[0,2,0,3],[1,0,1,1],[0,12,3,12]]}
["Soil moisture class (GEST)",null,"Water tables in relation to surface (+ above, - below)",null,"Relevant classes","winter",null,"zomer",null,"baseline","Rewetting",null,"Soil moisture classes and associated water tables (modified after KOSKA et al. 2001). Soil moisture classes are characterised by: WLw: long-term median water table in the wet season; WLd: long-term median water table in the dry season; and WD: water supply deficit. Seasonally alternating wetness is indicated by a combination of different classes, e.g. 5+/4+ refers to a WLw within 5+ range and a WLd within 4+ range. Strongly alternating wetness is indicated by a tilde-sign, e.g. 3~ refers to a WLw within 4+ range and a WLd within 2+ range."]
[null,null,"WLw","WLd",null,"hoogste ","laagste","hoogste ","laagste","Zomer","Zomer"]
["7+","Upper sublitoral","+250 to +140 cm","+250 to +140 cm"]
["6+","Flooded (lower eulittoral)","+150 to +10 cm","+140 to +0 cm","X",150,10,{"$f":"140.000000000001","v":140.00000000000099},0,{"$f":"IF(AND(Input!$G$43<'soil moisture classes '!H4,Input!$G$43>='soil moisture classes '!I4),'soil moisture classes '!A4,\"\")","v":"6+"},{"$f":"IF(AND(Input!$G$50<'soil moisture classes '!H4,Input!$G$50>='soil moisture classes '!I4),'soil moisture classes '!A4,\"\")","v":"6+"}]
["5+","Wet (upper eulittoral)","+ 10 to – 5 cm","+0 to -10 cm","X",9.9999999899999992,-5,-9.9999999999999998E-13,-10,{"$f":"IF(AND(Input!$G$43<'soil moisture classes '!H5,Input!$G$43>='soil moisture classes '!I5),'soil moisture classes '!A5,\"\")","v":""},{"$f":"IF(AND(Input!$G$50<'soil moisture classes '!H5,Input!$G$50>='soil moisture classes '!I5),'soil moisture classes '!A5,\"\")","v":""}]
["4+","Semi wet (very moist)","-5 -to -15 cm","-10 to -20 cm","X",-5.0000000001,-15,-10.000000001,-20,{"$f":"IF(AND(Input!$G$43<'soil moisture classes '!H6,Input!$G$43>='soil moisture classes '!I6),'soil moisture classes '!A6,\"\")","v":""},{"$f":"IF(AND(Input!$G$50<'soil moisture classes '!H6,Input!$G$50>='soil moisture classes '!I6),'soil moisture classes '!A6,\"\")","v":""}]
["3+","moist","-15 to -35 cm","-20 to -45 cm","X",-15.000000000009999,-35,-20.000000000010001,-45,{"$f":"IF(AND(Input!$G$43<'soil moisture classes '!H7,Input!$G$43>='soil moisture classes '!I7),'soil moisture classes '!A7,\"\")","v":""},{"$f":"IF(AND(Input!$G$50<'soil moisture classes '!H7,Input!$G$50>='soil moisture classes '!I7),'soil moisture classes '!A7,\"\")","v":""},null,"Table from Joosten et al. 2015; who modified after Koska et al. 2001"]
["2+","Moderate moist","-35 to -70 cm","-45 to -85 cm","X",-35.000000000009997,-70,-45.000000000009997,-85,{"$f":"IF(AND(Input!$G$43<'soil moisture classes '!H8,Input!$G$43>='soil moisture classes '!I8),'soil moisture classes '!A8,\"\")","v":""},{"$f":"IF(AND(Input!$G$50<'soil moisture classes '!H8,Input!$G$50>='soil moisture classes '!I8),'soil moisture classes '!A8,\"\")","v":""},null,"Sources:"]
["2-","Moderate dry","< 60 l / m2","< -85 cm","X",-70.000000000010004,-1000000000000,-85.000000000000995,null,{"$f":"IF(Input!$G$43<'soil moisture classes '!H9,'soil moisture classes '!A9,\"\")","v":""},{"$f":"IF(Input!$G$50<'soil moisture classes '!H9,'soil moisture classes '!A9,\"\")","v":""}]
["3-","Dry","60 – 100 l / m2",null,null,null,null,null,null,{"$f":"SUBSTITUTE(TRIM(J4&\" \"&J5&\" \"&J6&\" \"&J7&\" \"&J8&\" \"&J9),\" \",\";\")","v":"6+"},{"$f":"SUBSTITUTE(TRIM(K4&\" \"&K5&\" \"&K6&\" \"&K7&\" \"&K8&\" \"&K9),\" \",\";\")","v":"6+"},null,"Joosten, H., K. Brsut, J. Couwenberg, A. Gerner, B. Holsten, T. Permien, A. Schäfer, F. Tanneberger, M. Trepel & A. Wahren 2015. MoorFutures. Integration of additional ecosystem services (including biodiversity) into carbon crdits - standard, methodology and transferability to other regions. BfN-Skripten 407. Federal Agency for Nature Conservation, Bonn, Germany"]
["4-","Very dry","100 – 140 l / m2",null,null,null,null,null,null,null,null,null,"Koska, I, Succow, M, Clausnitzer, U., Timmermann, T., Roth, S. (2001): Vegetationskundliche Kennzeichnung von Mooren (topische Betrachtung). In: Succow, M., Joosten, H. (eds.): Landschaftsökologische Moorkunde. Schweizerbarth, Stuttgart. Pp. 112 – 184."]
["5-","Extremely dry",">140 l / m2"]
[]
[]
[null,"uitkomst baseline Soil moisture class",{"$f":"J10","v":"6+"},{"$f":"IF(C$15=A4,B4,IF(C$15=A5,B5,IF(C$15=A6,B6,IF(C$15=A7,B7,IF(C$15=A8,B8,\"FOUT\")))))","v":"Flooded (lower eulittoral)"},{"$f":"CONCATENATE(C15,\":\",\" \",D15)","v":"6+: Flooded (lower eulittoral)"}]
[null,"uitkomst rewetting Soil moisture class",{"$f":"K10","v":"6+"},{"$f":"IF(C$16=A4,B4,IF(C$16=A5,B5,IF(C$16=A6,B6,IF(C$16=A7,B7,IF(C$16=A8,B8,\"FOUT\")))))","v":"Flooded (lower eulittoral)"},{"$f":"CONCATENATE(C16,\":\",\" \",D16)","v":"6+: Flooded (lower eulittoral)"}]

{"sheet":"GEST 2.0","index":7,"n_rows":91,"n_cols":52,"rows_kept":91,"cut":false,"hidden":true,"merged":[[0,40,0,41],[0,42,0,43],[0,46,0,47],[0,48,0,49],[0,51,5,57],[0,0,1,0],[0,1,1,1],[0,2,1,2],[0,9,0,10],[0,11,0,12],[0,30,0,31],[0,34,0,35],[0,36,0,37],[0,16,0,17],[0,18,0,19],[0,22,0,23],[0,24,0,25],[0,28,0,29]]}
["N°","GEST","Soil Moisture Classes","Summer Moisture classes disaggregate",null,null,null,null,null,"CH4",null,"CO2",null,"Total C-flux","Total C-flux",{"$f":"'soil moisture classes '!J10","v":"6+"},"CH4",null,"CO2",null,"Total C-flux",null,"CH4",null,"CO2",null,"Total C-flux",null,"CH4",null,"CO2",null,"Total C-flux",null,"CH4",null,"CO2",null,"Total C-flux",null,"CH4",null,"CO2",null,"Total C-flux",null,"CH4",null,"CO2",null,"Total C-flux","List of aggregated GESTs as a result of clustering CH4 and CO2 flux measurements (CH4 & CO2 emissions averaged as GWP in t CO2e·ha-1·a-1; bold – measured; italic – estimate of similar GEST; Trend: (+) – higher than, (-) – lower than, (~) – nearly the same as in Couwenberg et al. 2008, 2011, (*) – new GEST)"]
[null,null,null,"6+","5+","4+","3+","2+","2-","GWP","n","GWP","n","GWP","ton C/ha",{"$f":"D2","v":"6+"},"GWP","n","GWP","n","GWP",{"$f":"E2","v":"5+"},"GWP","n","GWP","n","GWP",{"$f":"F2","v":"4+"},"GWP","n","GWP","n","GWP",{"$f":"G2","v":"3+"},"GWP","n","GWP","n","GWP",{"$f":"H2","v":"2+"},"GWP","n","GWP","n","GWP",{"$f":"I2","v":"2-"},"GWP","n","GWP","n","GWP"]
[null,"Grassland"]
["G1","Dry to moderately moist grassland","(2~), 2+, 2- ",null,null,null,null,"2+","2-",-0.01,24,31.44,16,31.5,8.5742454545454549,{"$f":"IF(D4=D$2,CONCATENATE($A4,\":\",\" \",$B4),\"\")","v":""},{"$f":"IF($D4=$D$2,J4,\"\")","v":""},{"$f":"IF($D4=$D$2,K4,\"\")","v":""},{"$f":"IF($D4=$D$2,L4,\"\")","v":""},{"$f":"IF($D4=$D$2,M4,\"\")","v":""},{"$f":"IF($D4=$D$2,N4,\"\")","v":""},{"$f":"IF(E4=E$2,CONCATENATE($A4,\":\",\" \",$B4),\"\")","v":""},{"$f":"IF($E4=$E$2,J4,\"\")","v":""},{"$f":"IF($E4=$E$2,K4,\"\")","v":""},{"$f":"IF($E4=$E$2,L4,\"\")","v":""},{"$f":"IF($E4=$E$2,M4,\"\")","v":""},{"$f":"IF($E4=$E$2,N4,\"\")","v":""},{"$f":"IF(F4=F$2,CONCATENATE($A4,\":\",\" \",$B4),\"\")","v":""},{"$f":"IF($F4=$F$2,J4,\"\")","v":""},{"$f":"IF($F4=$F$2,K4,\"\")","v":""},{"$f":"IF($F4=$F$2,L4,\"\")","v":""},{"$f":"IF($F4=$F$2,M4,\"\")","v":""},{"$f":"IF($F4=$F$2,N4,\"\")","v":""},{"$f":"IF(G4=G$2,CONCATENATE($A4,\":\",\" \",$B4),\"\")","v":""},{"$f":"IF($G4=$G$2,J4,\"\")","v":""},{"$f":"IF($G4=$G$2,K4,\"\")","v":""},{"$f":"IF($G4=$G$2,L4,\"\")","v":""},{"$f":"IF($G4=$G$2,M4,\"\")","v":""},{"$f":"IF($G4=$G$2,N4,\"\")","v":""},{"$f":"IF(H4=H$2,CONCATENATE($A4,\":\",\" \",$B4),\"\")","v":"G1: Dry to moderately moist grassland"},{"$f":"IF($H4=$H$2,J4,\"\")","v":-0.01},{"$f":"IF($H4=$H$2,K4,\"\")","v":24},{"$f":"IF($H4=$H$2,L4,\"\")","v":31.44},{"$f":"IF($H4=$H$2,M4,\"\")","v":16},{"$f":"IF($H4=$H$2,N4,\"\")","v":31.5},{"$f":"IF(I4=I$2,CONCATENATE($A4,\":\",\" \",$B4),\"\")","v":"G1: Dry to moderately moist grassland"},{"$f":"IF($I4=$I$2,J4,\"\")","v":-0.01},{"$f":"IF($I4=$I$2,K4,\"\")","v":24},{"$f":"IF($I4=$I$2,L4,\"\")","v":31.44},{"$f":"IF($I4=$I$2,M4,\"\")","v":16}]
["G2","Moist grassland","3+, 3+/2+",null,null,null,"3+","2+",null,0.01,48,19.37,38,19.5,5.2830272727272733,{"$f":"IF(D5=D$2,CONCATENATE($A5,\":\",\" \",$B5),\"\")","v":""},"","","","","",{"$f":"IF(E5=E$2,CONCATENATE($A5,\":\",\" \",$B5),\"\")","v":""},"","","","","",{"$f":"IF(F5=F$2,CONCATENATE($A5,\":\",\" \",$B5),\"\")","v":""},"","","","","",{"$f":"IF(G5=G$2,CONCATENATE($A5,\":\",\" \",$B5),\"\")","v":"G2: Moist grassland"},0.01,48,19.37,38,19.5,{"$f":"IF(H5=H$2,CONCATENATE($A5,\":\",\" \",$B5),\"\")","v":"G2: Moist grassland"},0.01,48,19.37,38,19.5,{"$f":"IF(I5=I$2,CONCATENATE($A5,\":\",\" \",$B5),\"\")","v":""},"","","",""]
["G3","Moist to very moist grassland","4+/3+",null,null,null,"3+",null,null,0.03,3,13.46,4,13.5,3.671809090909091,"","","","","","","","","","","","","","","","","","","G3: Moist to very moist grassland",0.03,3,13.46,4,13.5,"","","","","","","","","","",""]
["G3f","Periodically flooded grasslands","4~, 3~",null,null,"4+","3+","2+",null,-0.05,3,13.46,"-",13,3.6694090909090908,"","","","","","","","","","","","","G3f: Periodically flooded grasslands",-0.05,3,13.46,"-",13,"G3f: Periodically flooded grasslands",-0.05,3,13.46,"-",13,"G3f: Periodically flooded grasslands",-0.05,3,13.46,"-",13,"","","","",""]
["G3s","Moist to very moist grassland with shunt  species","4+/3+, 3~, (3+, 3+/2+)",null,null,null,"3+","2+",null,0.75,7,13.46,"-",14,3.6934090909090909,"","","","","","","","","","","","","","","","","","","G3s: Moist to very moist grassland with shunt  species",0.75,7,13.46,"-",14,"G3s: Moist to very moist grassland with shunt  species",0.75,7,13.46,"-",14,"","","","","","shunt species here is Juncus"]
["G3m","Moist to very moist acidic Molinia meadows","4+/3+",null,null,null,"3+",null,null,4.8499999999999996,6,6.45,"-",11.5,1.9045909090909092,"","","","","","","","","","","","","","","","","","","G3m: Moist to very moist acidic Molinia meadows",4.8499999999999996,6,6.45,"-",11.5,"","","","","","","","","","","","CO2 changed from 13.46 to 6.45, because it is effectively just very moist grassland (G4)"]
["G4","Very moist grassland","4+, 4~",null,null,"4+","3+",null,null,0.39,7,6.45,3,7,1.7707909090909093,"","","","","","","","","","","","","G4: Very moist grassland",0.39,7,6.45,3,7,"G4: Very moist grassland",0.39,7,6.45,3,7,"","","","","","","","","","",""]
["G4s","Very moist grassland with shunt species ","4+",null,null,"4+",null,null,null,2.1,4,6.45,"-",8.5,1.8220909090909092,"","","","","","","","","","","","","G4s: Very moist grassland with shunt species ",2.1,4,6.45,"-",8.5,"","","","","","","","","","","","","","","","","","shunt species here is Juncus (very deep roots!)"]
["G5","Wet grassland","5+/4+",null,null,"4+",null,null,null,0.05,3,-3.89,5,-4,-1.059409090909091,"","","","","","","","","","","","","G5: Wet grassland",0.05,3,-3.89,5,-4,"","","","","","","","","","","","","","","","",""]
["G5s","Wet grassland with shunt species","5+, 5+/4+, (4~)",null,"5+","4+","3+",null,null,2.93,4,-3.89,"-",-1,-0.97300909090909105,"","","","","","","G5s: Wet grassland with shunt species",{"$f":"IF($E13=$E$2,J13,\"\")","v":2.93},{"$f":"IF($E13=$E$2,K13,\"\")","v":4},{"$f":"IF($E13=$E$2,L13,\"\")","v":-3.89},{"$f":"IF($E13=$E$2,M13,\"\")","v":"-"},{"$f":"IF($E13=$E$2,N13,\"\")","v":-1},"G5s: Wet grassland with shunt species",{"$f":"IF($F13=$F$2,J13,\"\")","v":2.93},{"$f":"IF($F13=$F$2,K13,\"\")","v":4},{"$f":"IF($F13=$F$2,L13,\"\")","v":-3.89},{"$f":"IF($F13=$F$2,M13,\"\")","v":"-"},{"$f":"IF($F13=$F$2,N13,\"\")","v":-1},"G5s: Wet grassland with shunt species",{"$f":"IF($G13=$G$2,J13,\"\")","v":2.93},{"$f":"IF($G13=$G$2,K13,\"\")","v":4},{"$f":"IF($G13=$G$2,L13,\"\")","v":-3.89},{"$f":"IF($G13=$G$2,M13,\"\")","v":"-"},{"$f":"IF($G13=$G$2,N13,\"\")","v":-1},"",{"$f":"IF($H13=$H$2,J13,\"\")","v":""},{"$f":"IF($H13=$H$2,K13,\"\")","v":""},{"$f":"IF($H13=$H$2,L13,\"\")","v":""},{"$f":"IF($H13=$H$2,M13,\"\")","v":""},{"$f":"IF($H13=$H$2,N13,\"\")","v":""},"",{"$f":"IF($I13=$I$2,J13,\"\")","v":""},{"$f":"IF($I13=$I$2,K13,\"\")","v":""},{"$f":"IF($I13=$I$2,L13,\"\")","v":""},{"$f":"IF($I13=$I$2,M13,\"\")","v":""}]
[null,"Cropland",null,null,null,null,null,null,null,null,null,null,null,null,null,"","","","","","","",{"$f":"IF($E14=$E$2,J14,\"\")","v":""},{"$f":"IF($E14=$E$2,K14,\"\")","v":""},{"$f":"IF($E14=$E$2,L14,\"\")","v":""},{"$f":"IF($E14=$E$2,M14,\"\")","v":""},{"$f":"IF($E14=$E$2,N14,\"\")","v":""},"",{"$f":"IF($F14=$F$2,J14,\"\")","v":""},{"$f":"IF($F14=$F$2,K14,\"\")","v":""},{"$f":"IF($F14=$F$2,L14,\"\")","v":""},{"$f":"IF($F14=$F$2,M14,\"\")","v":""},{"$f":"IF($F14=$F$2,N14,\"\")","v":""},"",{"$f":"IF($G14=$G$2,J14,\"\")","v":""},{"$f":"IF($G14=$G$2,K14,\"\")","v":""},{"$f":"IF($G14=$G$2,L14,\"\")","v":""},{"$f":"IF($G14=$G$2,M14,\"\")","v":""},{"$f":"IF($G14=$G$2,N14,\"\")","v":""},"",{"$f":"IF($H14=$H$2,J14,\"\")","v":""},{"$f":"IF($H14=$H$2,K14,\"\")","v":""},{"$f":"IF($H14=$H$2,L14,\"\")","v":""},{"$f":"IF($H14=$H$2,M14,\"\")","v":""},{"$f":"IF($H14=$H$2,N14,\"\")","v":""},"",{"$f":"IF($I14=$I$2,J14,\"\")","v":""},{"$f":"IF($I14=$I$2,K14,\"\")","v":""},{"$f":"IF($I14=$I$2,L14,\"\")","v":""},{"$f":"IF($I14=$I$2,M14,\"\")","v":""}]
["A1","Dry to moderately moist arable land","2+, 2-",null,null,null,null,"2+","2-",0.08,11,41.69,10,42,11.372399999999999,"","","","","","","","","","","","","","","","","","","","","","","","","A1: Dry to moderately moist arable land",0.08,11,41.69,10,42,"A1: Dry to moderately moist arable land",0.08,11,41.69,10]
["A2","Moist arable land","3+, 3+/2+",null,null,null,"3+","2+",null,0.17,6,23.44,4,23.5,6.3978272727272723,"","","","","","","","","","","","","","","","","","","A2: Moist arable land",0.17,6,23.44,4,23.5,"A2: Moist arable land",0.17,6,23.44,4,23.5,"","","","",""]
[null,"Unmanaged",null,null,null,null,null,null,null,null,null,null,null,null,null,"","","","","","","","","","","","","","","","","","","","","","","","","","","","","","","","","","",""]
["U1","Moist bare peat","3~, 3+",null,null,null,"3+","2+",null,0.03,2,8.99,2,9,2.4527181818181818,"","","","","","","","","","","","","","","","","","","U1: Moist bare peat",0.03,2,8.99,2,9,"U1: Moist bare peat",0.03,2,8.99,2,9,"","","","",""]
["U2","Moist bog heath","3+",null,null,null,"3+",null,null,0.25,10,12.33,5,12.5,3.3702272727272722,"","","","","","","","","","","","","","","","","","","U2: Moist bog heath",0.25,10,12.33,5,12.5,"","","","","","","","","","",""]
["U3","Moist Reeds","3+, (3~)",null,null,null,"3+","2+",null,0.04,1,2.77,2,3,0.75665454545454547,"","","","","","","","","","","","","","","","","","","U3: Moist Reeds",0.04,1,2.77,2,3,"U3: Moist Reeds",0.04,1,2.77,2,3,"","","","",""]
["U6","Very moist bog heath","(5+/4+), 4+",null,null,"4+",null,null,null,0.92,6,4.67,5,5.5,1.3012363636363637,"","","","","","","","","","","","","U6: Very moist bog heath",0.92,6,4.67,5,5.5,"","","","","","","","","","","","","","","","",""]
["U7","Very moist forbs and sedges","(5+/4+), 4+, (4+/3+)",null,null,"4+","3+",null,null,0.25,5,12.56,6,13,3.4329545454545456,"","","","","","","","","","","","","U7: Very moist forbs and sedges",0.25,5,12.56,6,13,"U7: Very moist forbs and sedges",0.25,5,12.56,6,13,"","","","","","","","","","",""]
["U8","Very moist Sphagnum lawn","(5+/4+), 4+",null,null,"4+",null,null,null,1.5,12,-4.3,11,-3,-1.1277272727272727,"","","","","","","","","","","","","U8: Very moist Sphagnum lawn",1.5,12,-4.3,11,-3,"","",{"$f":"IF($G23=$G$2,K23,\"\")","v":""},{"$f":"IF($G23=$G$2,L23,\"\")","v":""},{"$f":"IF($G23=$G$2,M23,\"\")","v":""},{"$f":"IF($G23=$G$2,N23,\"\")","v":""},"","",{"$f":"IF($H23=$H$2,K23,\"\")","v":""},{"$f":"IF($H23=$H$2,L23,\"\")","v":""},{"$f":"IF($H23=$H$2,M23,\"\")","v":""},{"$f":"IF($H23=$H$2,N23,\"\")","v":""},"","",{"$f":"IF($I23=$I$2,K23,\"\")","v":""},{"$f":"IF($I23=$I$2,L23,\"\")","v":""},{"$f":"IF($I23=$I$2,M23,\"\")","v":""}]
["U9","Very moist tall sedges","(5+/4+), 4~, 4+, (4+/3+)",null,null,"4+","3+",null,null,1.6,12,10.72,4,12.5,2.9716363636363639,"","","","","","","","","","","","","U9: Very moist tall sedges",1.6,12,10.72,4,12.5,"U9: Very moist tall sedges",1.6,12,10.72,4,12.5,"","","","","","","","","","",""]
["U10","Wet bare peat","5+/4+",null,null,"4+",null,null,null,0.22,3,1.34,3,1.5,0.37205454545454547,"","","","","","","","","","","","","U10: Wet bare peat",0.22,3,1.34,3,1.5,"","","","","","","","","","","","","","","","",""]
["U11","Wet meadows and forbs","5+",null,"5+",null,null,null,null,7.35,2,-3.89,"-",3.5,-0.84040909090909111,"","","","","","","U11: Wet meadows and forbs",7.35,2,-3.89,"-",3.5,"","","","","","","","","","","","","","","","","","","","","","",""]
["U12","Wet small sedges with mosses","5+ (4+)",null,"5+","4+",null,null,null,4.72,23,-1.99,15,2.5,-0.40112727272727272,"","","","","","","U12: Wet small sedges with mosses",4.72,23,-1.99,15,2.5,"U12: Wet small sedges with mosses",4.72,23,-1.99,15,2.5,"","","","","","","","","","","","","","","","",""]
["U13","Wet sphagnum lawn","5+, (5+/4+)",null,"5+","4+",null,null,null,5.25,6,-3.02,6,2,-0.66613636363636364,"","","","","","","U13: Wet sphagnum lawn",5.25,6,-3.02,6,2,"U13: Wet sphagnum lawn",5.25,6,-3.02,6,2,"","","","","","","","","","","","","","","","",""]
["U14","Wet tall reeds","(5~), 5+, (5+/4+)",null,"5+","4+",null,null,null,6.47,10,0.21,2,6.5,0.25137272727272725,"","","","","","","U14: Wet tall reeds",6.47,10,0.21,2,6.5,"U14: Wet tall reeds",6.47,10,0.21,2,6.5,"","","","","","","","","","","","","","","","",""]
["U15","Wet tall sedges","5~, 5+, (5+/4+)",null,"5+","4+",null,null,null,9.49,3,1.03,2,10.5,0.56560909090909095,"","","","","","","U15: Wet tall sedges",9.49,3,1.03,2,10.5,"U15: Wet tall sedges",9.49,3,1.03,2,10.5,"","","","","","","","","","","","","","","","",""]
["U16","Wet bog heath","6+/5+, 5+, (5+/4+)",null,"5+","4+",null,null,null,17.8,1,-0.01,7,18,0.53127272727272734,"","","","","","","U16: Wet bog heath",17.8,1,-0.01,7,18,"U16: Wet bog heath",17.8,1,-0.01,7,18,"","","","","","","","","","","","","","","","",""]
["U17","Very wet tall sedges and Typha","6+, 6+/5+","6+","5+",null,null,null,null,6.81,8,-1.08,8,5.5,-9.0245454545454573E-2,{"$f":"IF(D32=D$2,CONCATENATE($A32,\":\",\" \",$B32),\"\")","v":"U17: Very wet tall sedges and Typha"},{"$f":"IF($D32=$D$2,J32,\"\")","v":6.81},{"$f":"IF($D32=$D$2,K32,\"\")","v":8},{"$f":"IF($D32=$D$2,L32,\"\")","v":-1.08},{"$f":"IF($D32=$D$2,M32,\"\")","v":8},{"$f":"IF($D32=$D$2,N32,\"\")","v":5.5},"U17: Very wet tall sedges and Typha",6.81,8,-1.08,8,5.5,"","","","","","","","","","","","","","","","","","","","","","",""]
["U18","Very wet Phragmites reeds","6+, (6+/5+, 5~)","6+","5+","4+",null,null,null,12.44,12,-12.38,8,0,-3.0031636363636363,"U18: Very wet Phragmites reeds",{"$f":"IF($D33=$D$2,J33,\"\")","v":12.44},{"$f":"IF($D33=$D$2,K33,\"\")","v":12},{"$f":"IF($D33=$D$2,L33,\"\")","v":-12.38},{"$f":"IF($D33=$D$2,M33,\"\")","v":8},{"$f":"IF($D33=$D$2,N33,\"\")","v":0},"U18: Very wet Phragmites reeds",12.44,12,-12.38,8,0,"U18: Very wet Phragmites reeds",12.44,12,-12.38,8,0,"","","","","","","","","","","","","","","","",""]
["U19","Wet to very wet Sphagnum hollows","6+, (5+)","6+","5+",null,null,null,null,11.81,8,-4.58,8,7,-0.89479090909090897,"U19: Wet to very wet Sphagnum hollows",11.81,8,-4.58,8,7,"U19: Wet to very wet Sphagnum hollows",11.81,8,-4.58,8,7,"","","","","","","","","","","","","","","","","","","","","","",""]
["U20","Flooded tall reeds (> 20 cm above surface)","6+","6+",null,null,null,null,null,28.29,30,-32.74,6,-4.5,-8.0803909090909087,"U20: Flooded tall reeds (> 20 cm above surface)",28.29,30,-32.74,6,-4.5,"","","","","","","","","","","","","","","","","","","","","","","","","","","","",""]
[null,"Special GESTs",null,null,null,null,null,null,null,null,null,null,null,null,null,"","","","","","","","","","","","","","","","","","","","","","","","","","","","","","","","","","",""]
["S1","Dry to moderately moist grassland on peaty soils (Anmoor)","2-, 2+/2-, 2+",null,null,null,null,"2+","2-",-0.05,9,46.09,14,46,12.5685,"","","","","","","","","","","","","","","","","","","","","","","","","S1: Dry to moderately moist grassland on peaty soils (Anmoor)",-0.05,9,46.09,14,46,"S1: Dry to moderately moist grassland on peaty soils (Anmoor)",-0.05,9,46.09,14]
["S2","Dry to moderately moist arable land on peaty soils(Anmoor)","2+, 2-",null,null,null,null,"2+","2-",7.0000000000000007E-2,8,35.11,12,35,9.5775545454545465,"","","","","","","","","","","","","","","","","","","","","","","","","S2: Dry to moderately moist arable land on peaty soils(Anmoor)",7.0000000000000007E-2,8,35.11,12,35,"S2: Dry to moderately moist arable land on peaty soils(Anmoor)",7.0000000000000007E-2,8,35.11,12]
["S3","Cropland (2+) flooded in summer (wet year)","3+",null,null,null,"3+",null,null,10.29,1,22.61,1,33,6.475063636363636,"","","","","","","","","","","","","","","","","","","S3: Cropland (2+) flooded in summer (wet year)",10.29,1,22.61,1,33,"","","","","","","","","","",""]
["S4","Grassland (2+/3+) flooded in summer (wet year) ","(5+), 5+/4+, (4+)",null,"5+","4+",null,null,null,26.02,7,-0.13,6,26,0.74514545454545456,"","","","","","","S4: Grassland (2+/3+) flooded in summer (wet year) ",26.02,7,-0.13,6,26,"S4: Grassland (2+/3+) flooded in summer (wet year) ",26.02,7,-0.13,6,26,"","","","","","","","","","","","","","","","","","perhaps combine S3 and S4"]
["S5","Simulated harvest (Paludiculture)","(5+), 5+/4+",null,"5+","4+",null,null,null,3.08,3,11.46,3,14.5,3.217854545454546,"","","","","","","S5: Simulated harvest (Paludiculture)",3.08,3,11.46,3,14.5,"S5: Simulated harvest (Paludiculture)",3.08,3,11.46,3,14.5,"","","","","","","","","","","","","","","","",""]
["S6","Wet tall reeds (dry year)","(5+/4+), 4~, 4+",null,null,"4+","3+",null,null,0.79,7,10.72,"-",11.5,2.9473363636363636,"","","","","","","","","","","","","S6: Wet tall reeds (dry year)",0.79,7,10.72,"-",11.5,"S6: Wet tall reeds (dry year)",0.79,7,10.72,"-",11.5,"","","","","","","","","","",""]
["S7","Sphagnum lawn  at former peat cut areas","5+, 5+/4+",null,"5+","4+",null,null,null,37.270000000000003,3,2.83,2,40,1.8899181818181818,"","","","","","","S7: Sphagnum lawn  at former peat cut areas",37.270000000000003,3,2.83,2,40,"S7: Sphagnum lawn  at former peat cut areas",37.270000000000003,3,2.83,2,40,"","","","","","","","","","","","","","","","","","Das ist doch kein Sph. lawn, sondern eher wet bog sites? Ich habe diese Messungen jetzt bei den bog sites diskutiert und angegeben, dass niemand weiß, warum die Werte so hoch sind. S7 kann damit weg."]
["S8","Very wet reeds with lateral import of organic matter","6+, 6+/5+, (5~, 5+)","6+","5+","4+",null,null,null,42.27,18,2.39,18,44.5,1.9199181818181819,"S8: Very wet reeds with lateral import of organic matter",42.27,18,2.39,18,44.5,"S8: Very wet reeds with lateral import of organic matter",42.27,18,2.39,18,44.5,"S8: Very wet reeds with lateral import of organic matter",42.27,18,2.39,18,44.5,"","","","","","","","","","","","","","","","",""]
["S9","Ditches in low intensity grassland","6+","6+",null,null,null,null,null,3.17,3,"+/- 0","-",3,9.509999999999999E-2,"S9: Ditches in low intensity grassland",3.17,3,"+/- 0","-",3,"","","","","","","","","","","","","","","","","","","","","","","","","","","","",""]
[]
[]
[null,null,null,null,null,null,null,null,null,null,null,null,null,1,null,{"$f":"P32","v":"U17: Very wet tall sedges and Typha"},{"$f":"Q32","v":6.81},8,-1.08,8,5.5,{"$f":"V13","v":"G5s: Wet grassland with shunt species"},{"$f":"W13","v":2.93},4,-3.89,"-",-1,{"$f":"AB7","v":"G3f: Periodically flooded grasslands"},{"$f":"AC7","v":-0.05},3,13.46,"-",13,{"$f":"AH5","v":"G2: Moist grassland"},{"$f":"AI5","v":0.01},48,19.37,38,19.5,{"$f":"AN4","v":"G1: Dry to moderately moist grassland"},{"$f":"AO4","v":-0.01},24,31.44,16,31.5,{"$f":"AT4","v":"G1: Dry to moderately moist grassland"},{"$f":"AU4","v":-0.01},24,31.44,16]
[null,null,null,null,null,null,null,null,null,null,null,null,null,2,null,{"$f":"P33","v":"U18: Very wet Phragmites reeds"},{"$f":"Q33","v":12.44},12,-12.38,8,0,{"$f":"V26","v":"U11: Wet meadows and forbs"},{"$f":"W26","v":7.35},2,-3.89,"-",3.5,{"$f":"AB10","v":"G4: Very moist grassland"},{"$f":"AC10","v":0.39},7,6.45,3,7,"G3: Moist to very moist grassland",{"$f":"AI6","v":0.03},3,13.46,4,13.5,{"$f":"AN5","v":"G2: Moist grassland"},{"$f":"AO5","v":0.01},48,19.37,38,19.5,{"$f":"AT15","v":"A1: Dry to moderately moist arable land"},{"$f":"AU15","v":0.08},11,41.69,10]
[null,null,"Grassland",null,null,null,null,null,null,null,null,null,null,3,null,{"$f":"P34","v":"U19: Wet to very wet Sphagnum hollows"},{"$f":"Q34","v":11.81},8,-4.58,8,7,"U12: Wet small sedges with mosses",{"$f":"W27","v":4.72},23,-1.99,15,2.5,{"$f":"AB11","v":"G4s: Very moist grassland with shunt species "},{"$f":"AC11","v":2.1},4,6.45,"-",8.5,"G3f: Periodically flooded grasslands",{"$f":"AI7","v":-0.05},3,13.46,"-",13,{"$f":"AN7","v":"G3f: Periodically flooded grasslands"},{"$f":"AO7","v":-0.05},3,13.46,"-",13,{"$f":"AT37","v":"S1: Dry to moderately moist grassland on peaty soils (Anmoor)"},{"$f":"AU37","v":-0.05},9,46.09,14]
[" :","G1","Dry to moderately moist grassland",null,null,null,null,null,null,null,null,null,null,4,null,{"$f":"P35","v":"U20: Flooded tall reeds (> 20 cm above surface)"},{"$f":"Q35","v":28.29},30,-32.74,6,-4.5,"U13: Wet sphagnum lawn",{"$f":"W28","v":5.25},6,-3.02,6,2,{"$f":"AB12","v":"G5: Wet grassland"},{"$f":"AC12","v":0.05},3,-3.89,5,-4,"G3s: Moist to very moist grassland with shunt  species",{"$f":"AI8","v":0.75},7,13.46,"-",14,{"$f":"AN8","v":"G3s: Moist to very moist grassland with shunt  species"},{"$f":"AO8","v":0.75},7,13.46,"-",14,{"$f":"AT38","v":"S2: Dry to moderately moist arable land on peaty soils(Anmoor)"},{"$f":"AU38","v":7.0000000000000007E-2},8,35.11,12]
[" :","G2","Moist grassland",null,null,null,null,null,null,null,null,null,null,5,null,{"$f":"P44","v":"S8: Very wet reeds with lateral import of organic matter"},{"$f":"Q44","v":42.27},18,2.39,18,44.5,"U14: Wet tall reeds",{"$f":"W29","v":6.47},10,0.21,2,6.5,{"$f":"AB13","v":"G5s: Wet grassland with shunt species"},{"$f":"AC13","v":2.93},4,-3.89,"-",-1,"G3m: Moist to very moist acidic Molinia meadows",{"$f":"AI9","v":4.8499999999999996},6,6.45,"-",11.5,{"$f":"AN15","v":"A1: Dry to moderately moist arable land"},{"$f":"AO15","v":0.08},11,41.69,10,42,".",".",".",".","."]
[" :","G3","Moist to very moist grassland",null,null,null,null,null,null,null,null,null,null,6,null,{"$f":"P45","v":"S9: Ditches in low intensity grassland"},{"$f":"Q45","v":3.17},3,"+/- 0","-",3,"U15: Wet tall sedges",{"$f":"W30","v":9.49},3,1.03,2,10.5,{"$f":"AB21","v":"U6: Very moist bog heath"},{"$f":"AC21","v":0.92},6,4.67,5,5.5,"G4: Very moist grassland",{"$f":"AI10","v":0.39},7,6.45,3,7,{"$f":"AN16","v":"A2: Moist arable land"},{"$f":"AO16","v":0.17},6,23.44,4,23.5,".",".",".",".","."]
[" :","G3f","Periodically flooded grasslands",null,null,null,null,null,null,null,null,null,null,7,null,".",".",".",".",".",".","U16: Wet bog heath",{"$f":"W31","v":17.8},1,-0.01,7,18,{"$f":"AB22","v":"U7: Very moist forbs and sedges"},{"$f":"AC22","v":0.25},5,12.56,6,13,{"$f":"AH13","v":"G5s: Wet grassland with shunt species"},{"$f":"AI13","v":2.93},4,-3.89,"-",-1,{"$f":"AN18","v":"U1: Moist bare peat"},{"$f":"AO18","v":0.03},2,8.99,2,9,".",".",".",".","."]
[" :","G3s","Moist to very moist grassland with shunt  species",null,null,null,null,null,null,null,null,null,null,8,null,".",".",".",".",".",".","U17: Very wet tall sedges and Typha",{"$f":"W32","v":6.81},8,-1.08,8,5.5,{"$f":"AB23","v":"U8: Very moist Sphagnum lawn"},{"$f":"AC23","v":1.5},12,-4.3,11,-3,{"$f":"AH16","v":"A2: Moist arable land"},{"$f":"AI16","v":0.17},6,23.44,4,23.5,{"$f":"AN20","v":"U3: Moist Reeds"},{"$f":"AO20","v":0.04},1,2.77,2,3,".",".",".",".","."]
[" :","G3m","Moist to very moist acidic Molinia meadows",null,null,null,null,null,null,null,null,null,null,9,null,".",".",".",".",".",".","U18: Very wet Phragmites reeds",{"$f":"W33","v":12.44},12,-12.38,8,0,{"$f":"AB24","v":"U9: Very moist tall sedges"},{"$f":"AC24","v":1.6},12,10.72,4,12.5,{"$f":"AH18","v":"U1: Moist bare peat"},{"$f":"AI18","v":0.03},2,8.99,2,9,{"$f":"AN37","v":"S1: Dry to moderately moist grassland on peaty soils (Anmoor)"},{"$f":"AO37","v":-0.05},9,46.09,14,46,".",".",".",".","."]
[" :","G4","Very moist grassland",null,null,null,null,null,null,null,null,null,null,10,null,".",".",".",".",".",".","U19: Wet to very wet Sphagnum hollows",{"$f":"W34","v":11.81},8,-4.58,8,7,{"$f":"AB25","v":"U10: Wet bare peat"},{"$f":"AC25","v":0.22},3,1.34,3,1.5,{"$f":"AH19","v":"U2: Moist bog heath"},{"$f":"AI19","v":0.25},10,12.33,5,12.5,{"$f":"AN38","v":"S2: Dry to moderately moist arable land on peaty soils(Anmoor)"},{"$f":"AO38","v":7.0000000000000007E-2},8,35.11,12,35,".",".",".",".","."]
[" :","G4s","Very moist grassland with shunt species ",null,null,null,null,null,null,null,null,null,null,11,null,".",".",".",".",".",".",".",".",".",".",".",".",{"$f":"AB27","v":"U12: Wet small sedges with mosses"},{"$f":"AC27","v":4.72},23,-1.99,15,2.5,{"$f":"AH20","v":"U3: Moist Reeds"},{"$f":"AI20","v":0.04},1,2.77,2,3,".",".",".",".",".",".",".",".",".",".","."]
[" :","G5","Wet grassland",null,null,null,null,null,null,null,null,null,null,12,null,".",".",".",".",".",".",".",".",".",".",".",".",{"$f":"AB28","v":"U13: Wet sphagnum lawn"},{"$f":"AC28","v":5.25},6,-3.02,6,2,{"$f":"AH22","v":"U7: Very moist forbs and sedges"},{"$f":"AI22","v":0.25},5,12.56,6,13,".",".",".",".",".",".",".",".",".",".","."]
[" :","G5s","Wet grassland with shunt species",null,null,null,null,null,null,null,null,null,null,13,null,".",".",".",".",".",".",".",".",".",".",".",".",{"$f":"AB29","v":"U14: Wet tall reeds"},{"$f":"AC29","v":6.47},10,0.21,2,6.5,{"$f":"AH24","v":"U9: Very moist tall sedges"},{"$f":"AI24","v":1.6},12,10.72,4,12.5,".",".",".",".",".",".",".",".",".",".","."]
[" :","A1","Dry to moderately moist arable land",null,null,null,null,null,null,null,null,null,null,14,null,".",".",".",".",".",".",".",".",".",".",".",".",{"$f":"AB30","v":"U15: Wet tall sedges"},{"$f":"AC30","v":9.49},3,1.03,2,10.5,{"$f":"AH39","v":"S3: Cropland (2+) flooded in summer (wet year)"},{"$f":"AI39","v":10.29},1,22.61,1,33,".",".",".",".",".",".",".",".",".",".","."]
[" :","A2","Moist arable land",null,null,null,null,null,null,null,null,null,null,15,null,".",".",".",".",".",".",".",".",".",".",".",".",{"$f":"AB31","v":"U16: Wet bog heath"},{"$f":"AC31","v":17.8},1,-0.01,7,18,{"$f":"AH42","v":"S6: Wet tall reeds (dry year)"},{"$f":"AI42","v":0.79},7,10.72,"-",11.5,".",".",".",".",".",".",".",".",".",".","."]
[" :","U1","Moist bare peat",null,null,null,null,null,null,null,null,null,null,16,null,".",".",".",".",".",".",".",".",".",".",".",".",{"$f":"AB33","v":"U18: Very wet Phragmites reeds"},{"$f":"AC33","v":12.44},12,-12.38,8,0,".",".",".",".",".",".",".",".",".",".",".",".",".",".",".",".","."]
[" :","U2","Moist bog heath",null,null,null,null,null,null,null,null,null,null,17,null,".",".",".",".",".",".",".",".",".",".",".",".",{"$f":"AB40","v":"S4: Grassland (2+/3+) flooded in summer (wet year) "},{"$f":"AC40","v":26.02},7,-0.13,6,26,".",".",".",".",".",".",".",".",".",".",".",".",".",".",".",".","."]
[" :","U3","Moist Reeds",null,null,null,null,null,null,null,null,null,null,18,null,".",".",".",".",".",".",".",".",".",".",".",".",{"$f":"AB41","v":"S5: Simulated harvest (Paludiculture)"},{"$f":"AC41","v":3.08},3,11.46,3,14.5,".",".",".",".",".",".",".",".",".",".",".",".",".",".",".",".","."]
[" :","U6","Very moist bog heath",null,null,null,null,null,null,null,null,null,null,19,null,".",".",".",".",".",".",".",".",".",".",".",".",{"$f":"AB42","v":"S6: Wet tall reeds (dry year)"},{"$f":"AC42","v":0.79},7,10.72,"-",11.5,".",".",".",".",".",".",".",".",".",".",".",".",".",".",".",".","."]
[" :","U7","Very moist forbs and sedges",null,null,null,null,null,null,null,null,null,null,20,null,".",".",".",".",".",".",".",".",".",".",".",".",{"$f":"AB43","v":"S7: Sphagnum lawn  at former peat cut areas"},{"$f":"AC43","v":37.270000000000003},3,2.83,2,40,".",".",".",".",".",".",".",".",".",".",".",".",".",".",".",".","."]
[" :","U8","Very moist Sphagnum lawn",null,null,null,null,null,null,null,null,null,null,21,null,".",".",".",".",".",".",".",".",".",".",".",".",{"$f":"AB44","v":"S8: Very wet reeds with lateral import of organic matter"},{"$f":"AC44","v":42.27},18,2.39,18,44.5,".",".",".",".",".",".",".",".",".",".",".",".",".",".",".",".","."]
[" :","U9","Very moist tall sedges",null,null,null,null,null,null,null,null,null,null,null,null,"FOUT"]
[" :","U10","Wet bare peat",null,null,null,null,null,null,null,null,null,null,"Baseline",null,null,null,null,null,null,null,"Rewetting"]
[" :","U11","Wet meadows and forbs",null,null,null,null,null,null,null,null,null,null,1,null,{"$f":"IF('soil moisture classes '!$C$15='GEST 2.0'!$P$2,'GEST 2.0'!P48,IF('soil moisture classes '!$C$15='GEST 2.0'!$V$2,'GEST 2.0'!V48,IF('soil moisture classes '!$C$15='GEST 2.0'!$AB$2,'GEST 2.0'!AB48,IF('soil moisture classes '!$C$15='GEST 2.0'!$AH$2,'GEST 2.0'!AH48,IF('soil moisture classes '!$C$15='GEST 2.0'!$AN$2,'GEST 2.0'!AN48,IF('soil moisture classes '!$C$15='GEST 2.0'!$AT$2,'GEST 2.0'!AT48,\"\"))))))","v":"U17: Very wet tall sedges and Typha"},{"$f":"IF('soil moisture classes '!$C$15='GEST 2.0'!$P$2,'GEST 2.0'!Q48,IF('soil moisture classes '!$C$15='GEST 2.0'!$V$2,'GEST 2.0'!W48,IF('soil moisture classes '!$C$15='GEST 2.0'!$AB$2,'GEST 2.0'!AC48,IF('soil moisture classes '!$C$15='GEST 2.0'!$AH$2,'GEST 2.0'!AI48,IF('soil moisture classes '!$C$15='GEST 2.0'!$AN$2,'GEST 2.0'!AO48,IF('soil moisture classes '!$C$15='GEST 2.0'!$AT$2,'GEST 2.0'!AU48,\"\"))))))","v":6.81},{"$f":"IF('soil moisture classes '!$C$15='GEST 2.0'!$P$2,'GEST 2.0'!R48,IF('soil moisture classes '!$C$15='GEST 2.0'!$V$2,'GEST 2.0'!X48,IF('soil moisture classes '!$C$15='GEST 2.0'!$AB$2,'GEST 2.0'!AD48,IF('soil moisture classes '!$C$15='GEST 2.0'!$AH$2,'GEST 2.0'!AJ48,IF('soil moisture classes '!$C$15='GEST 2.0'!$AN$2,'GEST 2.0'!AP48,IF('soil moisture classes '!$C$15='GEST 2.0'!$AT$2,'GEST 2.0'!AV48,\"\"))))))","v":8},{"$f":"IF('soil moisture classes '!$C$15='GEST 2.0'!$P$2,'GEST 2.0'!S48,IF('soil moisture classes '!$C$15='GEST 2.0'!$V$2,'GEST 2.0'!Y48,IF('soil moisture classes '!$C$15='GEST 2.0'!$AB$2,'GEST 2.0'!AE48,IF('soil moisture classes '!$C$15='GEST 2.0'!$AH$2,'GEST 2.0'!AK48,IF('soil moisture classes '!$C$15='GEST 2.0'!$AN$2,'GEST 2.0'!AQ48,IF('soil moisture classes '!$C$15='GEST 2.0'!$AT$2,'GEST 2.0'!AW48,\"\"))))))","v":-1.08},{"$f":"IF('soil moisture classes '!$C$15='GEST 2.0'!$P$2,'GEST 2.0'!T48,IF('soil moisture classes '!$C$15='GEST 2.0'!$V$2,'GEST 2.0'!Z48,IF('soil moisture classes '!$C$15='GEST 2.0'!$AB$2,'GEST 2.0'!AF48,IF('soil moisture classes '!$C$15='GEST 2.0'!$AH$2,'GEST 2.0'!AL48,IF('soil moisture classes '!$C$15='GEST 2.0'!$AN$2,'GEST 2.0'!AR48,IF('soil moisture classes '!$C$15='GEST 2.0'!$AT$2,'GEST 2.0'!AX48,\"\"))))))","v":8},{"$f":"IF('soil moisture classes '!$C$15='GEST 2.0'!$P$2,'GEST 2.0'!U48,IF('soil moisture classes '!$C$15='GEST 2.0'!$V$2,'GEST 2.0'!AA48,IF('soil moisture classes '!$C$15='GEST 2.0'!$AB$2,'GEST 2.0'!AG48,IF('soil moisture classes '!$C$15='GEST 2.0'!$AH$2,'GEST 2.0'!AM48,IF('soil moisture classes '!$C$15='GEST 2.0'!$AN$2,'GEST 2.0'!AS48,IF('soil moisture classes '!$C$15='GEST 2.0'!$AT$2,'GEST 2.0'!AY48,\"\"))))))","v":5.5},{"$f":"IF('soil moisture classes '!$C$16='GEST 2.0'!$P$2,'GEST 2.0'!P48,IF('soil moisture classes '!$C$16='GEST 2.0'!$V$2,'GEST 2.0'!V48,IF('soil moisture classes '!$C$16='GEST 2.0'!$AB$2,'GEST 2.0'!AB48,IF('soil moisture classes '!$C$16='GEST 2.0'!$AH$2,'GEST 2.0'!AH48,IF('soil moisture classes '!$C$16='GEST 2.0'!$AN$2,'GEST 2.0'!AN48,IF('soil moisture classes '!$C$16='GEST 2.0'!$AT$2,'GEST 2.0'!AT48,\"\"))))))","v":"U17: Very wet tall sedges and Typha"},{"$f":"IF('soil moisture classes '!$C$16='GEST 2.0'!$P$2,'GEST 2.0'!Q48,IF('soil moisture classes '!$C$16='GEST 2.0'!$V$2,'GEST 2.0'!W48,IF('soil moisture classes '!$C$16='GEST 2.0'!$AB$2,'GEST 2.0'!AC48,IF('soil moisture classes '!$C$16='GEST 2.0'!$AH$2,'GEST 2.0'!AI48,IF('soil moisture classes '!$C$16='GEST 2.0'!$AN$2,'GEST 2.0'!AO48,IF('soil moisture classes '!$C$16='GEST 2.0'!$AT$2,'GEST 2.0'!AU48,\"\"))))))","v":6.81},{"$f":"IF('soil moisture classes '!$C$16='GEST 2.0'!$P$2,'GEST 2.0'!R48,IF('soil moisture classes '!$C$16='GEST 2.0'!$V$2,'GEST 2.0'!X48,IF('soil moisture classes '!$C$16='GEST 2.0'!$AB$2,'GEST 2.0'!AD48,IF('soil moisture classes '!$C$16='GEST 2.0'!$AH$2,'GEST 2.0'!AJ48,IF('soil moisture classes '!$C$16='GEST 2.0'!$AN$2,'GEST 2.0'!AP48,IF('soil moisture classes '!$C$16='GEST 2.0'!$AT$2,'GEST 2.0'!AV48,\"\"))))))","v":8},{"$f":"IF('soil moisture classes '!$C$16='GEST 2.0'!$P$2,'GEST 2.0'!S48,IF('soil moisture classes '!$C$16='GEST 2.0'!$V$2,'GEST 2.0'!Y48,IF('soil moisture classes '!$C$16='GEST 2.0'!$AB$2,'GEST 2.0'!AE48,IF('soil moisture classes '!$C$16='GEST 2.0'!$AH$2,'GEST 2.0'!AK48,IF('soil moisture classes '!$C$16='GEST 2.0'!$AN$2,'GEST 2.0'!AQ48,IF('soil moisture classes '!$C$16='GEST 2.0'!$AT$2,'GEST 2.0'!AW48,\"\"))))))","v":-1.08},{"$f":"IF('soil moisture classes '!$C$16='GEST 2.0'!$P$2,'GEST 2.0'!T48,IF('soil moisture classes '!$C$16='GEST 2.0'!$V$2,'GEST 2.0'!Z48,IF('soil moisture classes '!$C$16='GEST 2.0'!$AB$2,'GEST 2.0'!AF48,IF('soil moisture classes '!$C$16='GEST 2.0'!$AH$2,'GEST 2.0'!AL48,IF('soil moisture classes '!$C$16='GEST 2.0'!$AN$2,'GEST 2.0'!AR48,IF('soil moisture classes '!$C$16='GEST 2.0'!$AT$2,'GEST 2.0'!AX48,\"\"))))))","v":8},{"$f":"IF('soil moisture classes '!$C$16='GEST 2.0'!$P$2,'GEST 2.0'!U48,IF('soil moisture classes '!$C$16='GEST 2.0'!$V$2,'GEST 2.0'!AA48,IF('soil moisture classes '!$C$16='GEST 2.0'!$AB$2,'GEST 2.0'!AG48,IF('soil moisture classes '!$C$16='GEST 2.0'!$AH$2,'GEST 2.0'!AM48,IF('soil moisture classes '!$C$16='GEST 2.0'!$AN$2,'GEST 2.0'!AS48,IF('soil moisture classes '!$C$16='GEST 2.0'!$AT$2,'GEST 2.0'!AY48,\"\"))))))","v":5.5}]
[" :","U12","Wet small sedges with mosses",null,null,null,null,null,null,null,null,null,null,2,null,{"$f":"IF('soil moisture classes '!$C$15='GEST 2.0'!$P$2,'GEST 2.0'!P49,IF('soil moisture classes '!$C$15='GEST 2.0'!$V$2,'GEST 2.0'!V49,IF('soil moisture classes '!$C$15='GEST 2.0'!$AB$2,'GEST 2.0'!AB49,IF('soil moisture classes '!$C$15='GEST 2.0'!$AH$2,'GEST 2.0'!AH49,IF('soil moisture classes '!$C$15='GEST 2.0'!$AN$2,'GEST 2.0'!AN49,IF('soil moisture classes '!$C$15='GEST 2.0'!$AT$2,'GEST 2.0'!AT49,\"\"))))))","v":"U18: Very wet Phragmites reeds"},{"$f":"IF('soil moisture classes '!$C$15='GEST 2.0'!$P$2,'GEST 2.0'!Q49,IF('soil moisture classes '!$C$15='GEST 2.0'!$V$2,'GEST 2.0'!W49,IF('soil moisture classes '!$C$15='GEST 2.0'!$AB$2,'GEST 2.0'!AC49,IF('soil moisture classes '!$C$15='GEST 2.0'!$AH$2,'GEST 2.0'!AI49,IF('soil moisture classes '!$C$15='GEST 2.0'!$AN$2,'GEST 2.0'!AO49,IF('soil moisture classes '!$C$15='GEST 2.0'!$AT$2,'GEST 2.0'!AU49,\"\"))))))","v":12.44},{"$f":"IF('soil moisture classes '!$C$15='GEST 2.0'!$P$2,'GEST 2.0'!R49,IF('soil moisture classes '!$C$15='GEST 2.0'!$V$2,'GEST 2.0'!X49,IF('soil moisture classes '!$C$15='GEST 2.0'!$AB$2,'GEST 2.0'!AD49,IF('soil moisture classes '!$C$15='GEST 2.0'!$AH$2,'GEST 2.0'!AJ49,IF('soil moisture classes '!$C$15='GEST 2.0'!$AN$2,'GEST 2.0'!AP49,IF('soil moisture classes '!$C$15='GEST 2.0'!$AT$2,'GEST 2.0'!AV49,\"\"))))))","v":12},{"$f":"IF('soil moisture classes '!$C$15='GEST 2.0'!$P$2,'GEST 2.0'!S49,IF('soil moisture classes '!$C$15='GEST 2.0'!$V$2,'GEST 2.0'!Y49,IF('soil moisture classes '!$C$15='GEST 2.0'!$AB$2,'GEST 2.0'!AE49,IF('soil moisture classes '!$C$15='GEST 2.0'!$AH$2,'GEST 2.0'!AK49,IF('soil moisture classes '!$C$15='GEST 2.0'!$AN$2,'GEST 2.0'!AQ49,IF('soil moisture classes '!$C$15='GEST 2.0'!$AT$2,'GEST 2.0'!AW49,\"\"))))))","v":-12.38},{"$f":"IF('soil moisture classes '!$C$15='GEST 2.0'!$P$2,'GEST 2.0'!T49,IF('soil moisture classes '!$C$15='GEST 2.0'!$V$2,'GEST 2.0'!Z49,IF('soil moisture classes '!$C$15='GEST 2.0'!$AB$2,'GEST 2.0'!AF49,IF('soil moisture classes '!$C$15='GEST 2.0'!$AH$2,'GEST 2.0'!AL49,IF('soil moisture classes '!$C$15='GEST 2.0'!$AN$2,'GEST 2.0'!AR49,IF('soil moisture classes '!$C$15='GEST 2.0'!$AT$2,'GEST 2.0'!AX49,\"\"))))))","v":8},{"$f":"IF('soil moisture classes '!$C$15='GEST 2.0'!$P$2,'GEST 2.0'!U49,IF('soil moisture classes '!$C$15='GEST 2.0'!$V$2,'GEST 2.0'!AA49,IF('soil moisture classes '!$C$15='GEST 2.0'!$AB$2,'GEST 2.0'!AG49,IF('soil moisture classes '!$C$15='GEST 2.0'!$AH$2,'GEST 2.0'!AM49,IF('soil moisture classes '!$C$15='GEST 2.0'!$AN$2,'GEST 2.0'!AS49,IF('soil moisture classes '!$C$15='GEST 2.0'!$AT$2,'GEST 2.0'!AY49,\"\"))))))","v":0},{"$f":"IF('soil moisture classes '!$C$16='GEST 2.0'!$P$2,'GEST 2.0'!P49,IF('soil moisture classes '!$C$16='GEST 2.0'!$V$2,'GEST 2.0'!V49,IF('soil moisture classes '!$C$16='GEST 2.0'!$AB$2,'GEST 2.0'!AB49,IF('soil moisture classes '!$C$16='GEST 2.0'!$AH$2,'GEST 2.0'!AH49,IF('soil moisture classes '!$C$16='GEST 2.0'!$AN$2,'GEST 2.0'!AN49,IF('soil moisture classes '!$C$16='GEST 2.0'!$AT$2,'GEST 2.0'!AT49,\"\"))))))","v":"U18: Very wet Phragmites reeds"},{"$f":"IF('soil moisture classes '!$C$16='GEST 2.0'!$P$2,'GEST 2.0'!Q49,IF('soil moisture classes '!$C$16='GEST 2.0'!$V$2,'GEST 2.0'!W49,IF('soil moisture classes '!$C$16='GEST 2.0'!$AB$2,'GEST 2.0'!AC49,IF('soil moisture classes '!$C$16='GEST 2.0'!$AH$2,'GEST 2.0'!AI49,IF('soil moisture classes '!$C$16='GEST 2.0'!$AN$2,'GEST 2.0'!AO49,IF('soil moisture classes '!$C$16='GEST 2.0'!$AT$2,'GEST 2.0'!AU49,\"\"))))))","v":12.44},{"$f":"IF('soil moisture classes '!$C$16='GEST 2.0'!$P$2,'GEST 2.0'!R49,IF('soil moisture classes '!$C$16='GEST 2.0'!$V$2,'GEST 2.0'!X49,IF('soil moisture classes '!$C$16='GEST 2.0'!$AB$2,'GEST 2.0'!AD49,IF('soil moisture classes '!$C$16='GEST 2.0'!$AH$2,'GEST 2.0'!AJ49,IF('soil moisture classes '!$C$16='GEST 2.0'!$AN$2,'GEST 2.0'!AP49,IF('soil moisture classes '!$C$16='GEST 2.0'!$AT$2,'GEST 2.0'!AV49,\"\"))))))","v":12},{"$f":"IF('soil moisture classes '!$C$16='GEST 2.0'!$P$2,'GEST 2.0'!S49,IF('soil moisture classes '!$C$16='GEST 2.0'!$V$2,'GEST 2.0'!Y49,IF('soil moisture classes '!$C$16='GEST 2.0'!$AB$2,'GEST 2.0'!AE49,IF('soil moisture classes '!$C$16='GEST 2.0'!$AH$2,'GEST 2.0'!AK49,IF('soil moisture classes '!$C$16='GEST 2.0'!$AN$2,'GEST 2.0'!AQ49,IF('soil moisture classes '!$C$16='GEST 2.0'!$AT$2,'GEST 2.0'!AW49,\"\"))))))","v":-12.38},{"$f":"IF('soil moisture classes '!$C$16='GEST 2.0'!$P$2,'GEST 2.0'!T49,IF('soil moisture classes '!$C$16='GEST 2.0'!$V$2,'GEST 2.0'!Z49,IF('soil moisture classes '!$C$16='GEST 2.0'!$AB$2,'GEST 2.0'!AF49,IF('soil moisture classes '!$C$16='GEST 2.0'!$AH$2,'GEST 2.0'!AL49,IF('soil moisture classes '!$C$16='GEST 2.0'!$AN$2,'GEST 2.0'!AR49,IF('soil moisture classes '!$C$16='GEST 2.0'!$AT$2,'GEST 2.0'!AX49,\"\"))))))","v":8},{"$f":"IF('soil moisture classes '!$C$16='GEST 2.0'!$P$2,'GEST 2.0'!U49,IF('soil moisture classes '!$C$16='GEST 2.0'!$V$2,'GEST 2.0'!AA49,IF('soil moisture classes '!$C$16='GEST 2.0'!$AB$2,'GEST 2.0'!AG49,IF('soil moisture classes '!$C$16='GEST 2.0'!$AH$2,'GEST 2.0'!AM49,IF('soil moisture classes '!$C$16='GEST 2.0'!$AN$2,'GEST 2.0'!AS49,IF('soil moisture classes '!$C$16='GEST 2.0'!$AT$2,'GEST 2.0'!AY49,\"\"))))))","v":0}]
[" :","U13","Wet sphagnum lawn",null,null,null,null,null,null,null,null,null,null,3,null,{"$f":"IF('soil moisture classes '!$C$15='GEST 2.0'!$P$2,'GEST 2.0'!P50,IF('soil moisture classes '!$C$15='GEST 2.0'!$V$2,'GEST 2.0'!V50,IF('soil moisture classes '!$C$15='GEST 2.0'!$AB$2,'GEST 2.0'!AB50,IF('soil moisture classes '!$C$15='GEST 2.0'!$AH$2,'GEST 2.0'!AH50,IF('soil moisture classes '!$C$15='GEST 2.0'!$AN$2,'GEST 2.0'!AN50,IF('soil moisture classes '!$C$15='GEST 2.0'!$AT$2,'GEST 2.0'!AT50,\"\"))))))","v":"U19: Wet to very wet Sphagnum hollows"},{"$f":"IF('soil moisture classes '!$C$15='GEST 2.0'!$P$2,'GEST 2.0'!Q50,IF('soil moisture classes '!$C$15='GEST 2.0'!$V$2,'GEST 2.0'!W50,IF('soil moisture classes '!$C$15='GEST 2.0'!$AB$2,'GEST 2.0'!AC50,IF('soil moisture classes '!$C$15='GEST 2.0'!$AH$2,'GEST 2.0'!AI50,IF('soil moisture classes '!$C$15='GEST 2.0'!$AN$2,'GEST 2.0'!AO50,IF('soil moisture classes '!$C$15='GEST 2.0'!$AT$2,'GEST 2.0'!AU50,\"\"))))))","v":11.81},{"$f":"IF('soil moisture classes '!$C$15='GEST 2.0'!$P$2,'GEST 2.0'!R50,IF('soil moisture classes '!$C$15='GEST 2.0'!$V$2,'GEST 2.0'!X50,IF('soil moisture classes '!$C$15='GEST 2.0'!$AB$2,'GEST 2.0'!AD50,IF('soil moisture classes '!$C$15='GEST 2.0'!$AH$2,'GEST 2.0'!AJ50,IF('soil moisture classes '!$C$15='GEST 2.0'!$AN$2,'GEST 2.0'!AP50,IF('soil moisture classes '!$C$15='GEST 2.0'!$AT$2,'GEST 2.0'!AV50,\"\"))))))","v":8},{"$f":"IF('soil moisture classes '!$C$15='GEST 2.0'!$P$2,'GEST 2.0'!S50,IF('soil moisture classes '!$C$15='GEST 2.0'!$V$2,'GEST 2.0'!Y50,IF('soil moisture classes '!$C$15='GEST 2.0'!$AB$2,'GEST 2.0'!AE50,IF('soil moisture classes '!$C$15='GEST 2.0'!$AH$2,'GEST 2.0'!AK50,IF('soil moisture classes '!$C$15='GEST 2.0'!$AN$2,'GEST 2.0'!AQ50,IF('soil moisture classes '!$C$15='GEST 2.0'!$AT$2,'GEST 2.0'!AW50,\"\"))))))","v":-4.58},{"$f":"IF('soil moisture classes '!$C$15='GEST 2.0'!$P$2,'GEST 2.0'!T50,IF('soil moisture classes '!$C$15='GEST 2.0'!$V$2,'GEST 2.0'!Z50,IF('soil moisture classes '!$C$15='GEST 2.0'!$AB$2,'GEST 2.0'!AF50,IF('soil moisture classes '!$C$15='GEST 2.0'!$AH$2,'GEST 2.0'!AL50,IF('soil moisture classes '!$C$15='GEST 2.0'!$AN$2,'GEST 2.0'!AR50,IF('soil moisture classes '!$C$15='GEST 2.0'!$AT$2,'GEST 2.0'!AX50,\"\"))))))","v":8},{"$f":"IF('soil moisture classes '!$C$15='GEST 2.0'!$P$2,'GEST 2.0'!U50,IF('soil moisture classes '!$C$15='GEST 2.0'!$V$2,'GEST 2.0'!AA50,IF('soil moisture classes '!$C$15='GEST 2.0'!$AB$2,'GEST 2.0'!AG50,IF('soil moisture classes '!$C$15='GEST 2.0'!$AH$2,'GEST 2.0'!AM50,IF('soil moisture classes '!$C$15='GEST 2.0'!$AN$2,'GEST 2.0'!AS50,IF('soil moisture classes '!$C$15='GEST 2.0'!$AT$2,'GEST 2.0'!AY50,\"\"))))))","v":7},{"$f":"IF('soil moisture classes '!$C$16='GEST 2.0'!$P$2,'GEST 2.0'!P50,IF('soil moisture classes '!$C$16='GEST 2.0'!$V$2,'GEST 2.0'!V50,IF('soil moisture classes '!$C$16='GEST 2.0'!$AB$2,'GEST 2.0'!AB50,IF('soil moisture classes '!$C$16='GEST 2.0'!$AH$2,'GEST 2.0'!AH50,IF('soil moisture classes '!$C$16='GEST 2.0'!$AN$2,'GEST 2.0'!AN50,IF('soil moisture classes '!$C$16='GEST 2.0'!$AT$2,'GEST 2.0'!AT50,\"\"))))))","v":"U19: Wet to very wet Sphagnum hollows"},{"$f":"IF('soil moisture classes '!$C$16='GEST 2.0'!$P$2,'GEST 2.0'!Q50,IF('soil moisture classes '!$C$16='GEST 2.0'!$V$2,'GEST 2.0'!W50,IF('soil moisture classes '!$C$16='GEST 2.0'!$AB$2,'GEST 2.0'!AC50,IF('soil moisture classes '!$C$16='GEST 2.0'!$AH$2,'GEST 2.0'!AI50,IF('soil moisture classes '!$C$16='GEST 2.0'!$AN$2,'GEST 2.0'!AO50,IF('soil moisture classes '!$C$16='GEST 2.0'!$AT$2,'GEST 2.0'!AU50,\"\"))))))","v":11.81},{"$f":"IF('soil moisture classes '!$C$16='GEST 2.0'!$P$2,'GEST 2.0'!R50,IF('soil moisture classes '!$C$16='GEST 2.0'!$V$2,'GEST 2.0'!X50,IF('soil moisture classes '!$C$16='GEST 2.0'!$AB$2,'GEST 2.0'!AD50,IF('soil moisture classes '!$C$16='GEST 2.0'!$AH$2,'GEST 2.0'!AJ50,IF('soil moisture classes '!$C$16='GEST 2.0'!$AN$2,'GEST 2.0'!AP50,IF('soil moisture classes '!$C$16='GEST 2.0'!$AT$2,'GEST 2.0'!AV50,\"\"))))))","v":8},{"$f":"IF('soil moisture classes '!$C$16='GEST 2.0'!$P$2,'GEST 2.0'!S50,IF('soil moisture classes '!$C$16='GEST 2.0'!$V$2,'GEST 2.0'!Y50,IF('soil moisture classes '!$C$16='GEST 2.0'!$AB$2,'GEST 2.0'!AE50,IF('soil moisture classes '!$C$16='GEST 2.0'!$AH$2,'GEST 2.0'!AK50,IF('soil moisture classes '!$C$16='GEST 2.0'!$AN$2,'GEST 2.0'!AQ50,IF('soil moisture classes '!$C$16='GEST 2.0'!$AT$2,'GEST 2.0'!AW50,\"\"))))))","v":-4.58},{"$f":"IF('soil moisture classes '!$C$16='GEST 2.0'!$P$2,'GEST 2.0'!T50,IF('soil moisture classes '!$C$16='GEST 2.0'!$V$2,'GEST 2.0'!Z50,IF('soil moisture classes '!$C$16='GEST 2.0'!$AB$2,'GEST 2.0'!AF50,IF('soil moisture classes '!$C$16='GEST 2.0'!$AH$2,'GEST 2.0'!AL50,IF('soil moisture classes '!$C$16='GEST 2.0'!$AN$2,'GEST 2.0'!AR50,IF('soil moisture classes '!$C$16='GEST 2.0'!$AT$2,'GEST 2.0'!AX50,\"\"))))))","v":8},{"$f":"IF('soil moisture classes '!$C$16='GEST 2.0'!$P$2,'GEST 2.0'!U50,IF('soil moisture classes '!$C$16='GEST 2.0'!$V$2,'GEST 2.0'!AA50,IF('soil moisture classes '!$C$16='GEST 2.0'!$AB$2,'GEST 2.0'!AG50,IF('soil moisture classes '!$C$16='GEST 2.0'!$AH$2,'GEST 2.0'!AM50,IF('soil moisture classes '!$C$16='GEST 2.0'!$AN$2,'GEST 2.0'!AS50,IF('soil moisture classes '!$C$16='GEST 2.0'!$AT$2,'GEST 2.0'!AY50,\"\"))))))","v":7}]
[" :","U14","Wet tall reeds",null,null,null,null,null,null,null,null,null,null,4,null,{"$f":"IF('soil moisture classes '!$C$15='GEST 2.0'!$P$2,'GEST 2.0'!P51,IF('soil moisture classes '!$C$15='GEST 2.0'!$V$2,'GEST 2.0'!V51,IF('soil moisture classes '!$C$15='GEST 2.0'!$AB$2,'GEST 2.0'!AB51,IF('soil moisture classes '!$C$15='GEST 2.0'!$AH$2,'GEST 2.0'!AH51,IF('soil moisture classes '!$C$15='GEST 2.0'!$AN$2,'GEST 2.0'!AN51,IF('soil moisture classes '!$C$15='GEST 2.0'!$AT$2,'GEST 2.0'!AT51,\"\"))))))","v":"U20: Flooded tall reeds (> 20 cm above surface)"},{"$f":"IF('soil moisture classes '!$C$15='GEST 2.0'!$P$2,'GEST 2.0'!Q51,IF('soil moisture classes '!$C$15='GEST 2.0'!$V$2,'GEST 2.0'!W51,IF('soil moisture classes '!$C$15='GEST 2.0'!$AB$2,'GEST 2.0'!AC51,IF('soil moisture classes '!$C$15='GEST 2.0'!$AH$2,'GEST 2.0'!AI51,IF('soil moisture classes '!$C$15='GEST 2.0'!$AN$2,'GEST 2.0'!AO51,IF('soil moisture classes '!$C$15='GEST 2.0'!$AT$2,'GEST 2.0'!AU51,\"\"))))))","v":28.29},{"$f":"IF('soil moisture classes '!$C$15='GEST 2.0'!$P$2,'GEST 2.0'!R51,IF('soil moisture classes '!$C$15='GEST 2.0'!$V$2,'GEST 2.0'!X51,IF('soil moisture classes '!$C$15='GEST 2.0'!$AB$2,'GEST 2.0'!AD51,IF('soil moisture classes '!$C$15='GEST 2.0'!$AH$2,'GEST 2.0'!AJ51,IF('soil moisture classes '!$C$15='GEST 2.0'!$AN$2,'GEST 2.0'!AP51,IF('soil moisture classes '!$C$15='GEST 2.0'!$AT$2,'GEST 2.0'!AV51,\"\"))))))","v":30},{"$f":"IF('soil moisture classes '!$C$15='GEST 2.0'!$P$2,'GEST 2.0'!S51,IF('soil moisture classes '!$C$15='GEST 2.0'!$V$2,'GEST 2.0'!Y51,IF('soil moisture classes '!$C$15='GEST 2.0'!$AB$2,'GEST 2.0'!AE51,IF('soil moisture classes '!$C$15='GEST 2.0'!$AH$2,'GEST 2.0'!AK51,IF('soil moisture classes '!$C$15='GEST 2.0'!$AN$2,'GEST 2.0'!AQ51,IF('soil moisture classes '!$C$15='GEST 2.0'!$AT$2,'GEST 2.0'!AW51,\"\"))))))","v":-32.74},{"$f":"IF('soil moisture classes '!$C$15='GEST 2.0'!$P$2,'GEST 2.0'!T51,IF('soil moisture classes '!$C$15='GEST 2.0'!$V$2,'GEST 2.0'!Z51,IF('soil moisture classes '!$C$15='GEST 2.0'!$AB$2,'GEST 2.0'!AF51,IF('soil moisture classes '!$C$15='GEST 2.0'!$AH$2,'GEST 2.0'!AL51,IF('soil moisture classes '!$C$15='GEST 2.0'!$AN$2,'GEST 2.0'!AR51,IF('soil moisture classes '!$C$15='GEST 2.0'!$AT$2,'GEST 2.0'!AX51,\"\"))))))","v":6},{"$f":"IF('soil moisture classes '!$C$15='GEST 2.0'!$P$2,'GEST 2.0'!U51,IF('soil moisture classes '!$C$15='GEST 2.0'!$V$2,'GEST 2.0'!AA51,IF('soil moisture classes '!$C$15='GEST 2.0'!$AB$2,'GEST 2.0'!AG51,IF('soil moisture classes '!$C$15='GEST 2.0'!$AH$2,'GEST 2.0'!AM51,IF('soil moisture classes '!$C$15='GEST 2.0'!$AN$2,'GEST 2.0'!AS51,IF('soil moisture classes '!$C$15='GEST 2.0'!$AT$2,'GEST 2.0'!AY51,\"\"))))))","v":-4.5},{"$f":"IF('soil moisture classes '!$C$16='GEST 2.0'!$P$2,'GEST 2.0'!P51,IF('soil moisture classes '!$C$16='GEST 2.0'!$V$2,'GEST 2.0'!V51,IF('soil moisture classes '!$C$16='GEST 2.0'!$AB$2,'GEST 2.0'!AB51,IF('soil moisture classes '!$C$16='GEST 2.0'!$AH$2,'GEST 2.0'!AH51,IF('soil moisture classes '!$C$16='GEST 2.0'!$AN$2,'GEST 2.0'!AN51,IF('soil moisture classes '!$C$16='GEST 2.0'!$AT$2,'GEST 2.0'!AT51,\"\"))))))","v":"U20: Flooded tall reeds (> 20 cm above surface)"},{"$f":"IF('soil moisture classes '!$C$16='GEST 2.0'!$P$2,'GEST 2.0'!Q51,IF('soil moisture classes '!$C$16='GEST 2.0'!$V$2,'GEST 2.0'!W51,IF('soil moisture classes '!$C$16='GEST 2.0'!$AB$2,'GEST 2.0'!AC51,IF('soil moisture classes '!$C$16='GEST 2.0'!$AH$2,'GEST 2.0'!AI51,IF('soil moisture classes '!$C$16='GEST 2.0'!$AN$2,'GEST 2.0'!AO51,IF('soil moisture classes '!$C$16='GEST 2.0'!$AT$2,'GEST 2.0'!AU51,\"\"))))))","v":28.29},{"$f":"IF('soil moisture classes '!$C$16='GEST 2.0'!$P$2,'GEST 2.0'!R51,IF('soil moisture classes '!$C$16='GEST 2.0'!$V$2,'GEST 2.0'!X51,IF('soil moisture classes '!$C$16='GEST 2.0'!$AB$2,'GEST 2.0'!AD51,IF('soil moisture classes '!$C$16='GEST 2.0'!$AH$2,'GEST 2.0'!AJ51,IF('soil moisture classes '!$C$16='GEST 2.0'!$AN$2,'GEST 2.0'!AP51,IF('soil moisture classes '!$C$16='GEST 2.0'!$AT$2,'GEST 2.0'!AV51,\"\"))))))","v":30},{"$f":"IF('soil moisture classes '!$C$16='GEST 2.0'!$P$2,'GEST 2.0'!S51,IF('soil moisture classes '!$C$16='GEST 2.0'!$V$2,'GEST 2.0'!Y51,IF('soil moisture classes '!$C$16='GEST 2.0'!$AB$2,'GEST 2.0'!AE51,IF('soil moisture classes '!$C$16='GEST 2.0'!$AH$2,'GEST 2.0'!AK51,IF('soil moisture classes '!$C$16='GEST 2.0'!$AN$2,'GEST 2.0'!AQ51,IF('soil moisture classes '!$C$16='GEST 2.0'!$AT$2,'GEST 2.0'!AW51,\"\"))))))","v":-32.74},{"$f":"IF('soil moisture classes '!$C$16='GEST 2.0'!$P$2,'GEST 2.0'!T51,IF('soil moisture classes '!$C$16='GEST 2.0'!$V$2,'GEST 2.0'!Z51,IF('soil moisture classes '!$C$16='GEST 2.0'!$AB$2,'GEST 2.0'!AF51,IF('soil moisture classes '!$C$16='GEST 2.0'!$AH$2,'GEST 2.0'!AL51,IF('soil moisture classes '!$C$16='GEST 2.0'!$AN$2,'GEST 2.0'!AR51,IF('soil moisture classes '!$C$16='GEST 2.0'!$AT$2,'GEST 2.0'!AX51,\"\"))))))","v":6},{"$f":"IF('soil moisture classes '!$C$16='GEST 2.0'!$P$2,'GEST 2.0'!U51,IF('soil moisture classes '!$C$16='GEST 2.0'!$V$2,'GEST 2.0'!AA51,IF('soil moisture classes '!$C$16='GEST 2.0'!$AB$2,'GEST 2.0'!AG51,IF('soil moisture classes '!$C$16='GEST 2.0'!$AH$2,'GEST 2.0'!AM51,IF('soil moisture classes '!$C$16='GEST 2.0'!$AN$2,'GEST 2.0'!AS51,IF('soil moisture classes '!$C$16='GEST 2.0'!$AT$2,'GEST 2.0'!AY51,\"\"))))))","v":-4.5}]
[" :","U15","Wet tall sedges",null,null,null,null,null,null,null,null,null,null,5,null,{"$f":"IF('soil moisture classes '!$C$15='GEST 2.0'!$P$2,'GEST 2.0'!P52,IF('soil moisture classes '!$C$15='GEST 2.0'!$V$2,'GEST 2.0'!V52,IF('soil moisture classes '!$C$15='GEST 2.0'!$AB$2,'GEST 2.0'!AB52,IF('soil moisture classes '!$C$15='GEST 2.0'!$AH$2,'GEST 2.0'!AH52,IF('soil moisture classes '!$C$15='GEST 2.0'!$AN$2,'GEST 2.0'!AN52,IF('soil moisture classes '!$C$15='GEST 2.0'!$AT$2,'GEST 2.0'!AT52,\"\"))))))","v":"S8: Very wet reeds with lateral import of organic matter"},{"$f":"IF('soil moisture classes '!$C$15='GEST 2.0'!$P$2,'GEST 2.0'!Q52,IF('soil moisture classes '!$C$15='GEST 2.0'!$V$2,'GEST 2.0'!W52,IF('soil moisture classes '!$C$15='GEST 2.0'!$AB$2,'GEST 2.0'!AC52,IF('soil moisture classes '!$C$15='GEST 2.0'!$AH$2,'GEST 2.0'!AI52,IF('soil moisture classes '!$C$15='GEST 2.0'!$AN$2,'GEST 2.0'!AO52,IF('soil moisture classes '!$C$15='GEST 2.0'!$AT$2,'GEST 2.0'!AU52,\"\"))))))","v":42.27},{"$f":"IF('soil moisture classes '!$C$15='GEST 2.0'!$P$2,'GEST 2.0'!R52,IF('soil moisture classes '!$C$15='GEST 2.0'!$V$2,'GEST 2.0'!X52,IF('soil moisture classes '!$C$15='GEST 2.0'!$AB$2,'GEST 2.0'!AD52,IF('soil moisture classes '!$C$15='GEST 2.0'!$AH$2,'GEST 2.0'!AJ52,IF('soil moisture classes '!$C$15='GEST 2.0'!$AN$2,'GEST 2.0'!AP52,IF('soil moisture classes '!$C$15='GEST 2.0'!$AT$2,'GEST 2.0'!AV52,\"\"))))))","v":18},{"$f":"IF('soil moisture classes '!$C$15='GEST 2.0'!$P$2,'GEST 2.0'!S52,IF('soil moisture classes '!$C$15='GEST 2.0'!$V$2,'GEST 2.0'!Y52,IF('soil moisture classes '!$C$15='GEST 2.0'!$AB$2,'GEST 2.0'!AE52,IF('soil moisture classes '!$C$15='GEST 2.0'!$AH$2,'GEST 2.0'!AK52,IF('soil moisture classes '!$C$15='GEST 2.0'!$AN$2,'GEST 2.0'!AQ52,IF('soil moisture classes '!$C$15='GEST 2.0'!$AT$2,'GEST 2.0'!AW52,\"\"))))))","v":2.39},{"$f":"IF('soil moisture classes '!$C$15='GEST 2.0'!$P$2,'GEST 2.0'!T52,IF('soil moisture classes '!$C$15='GEST 2.0'!$V$2,'GEST 2.0'!Z52,IF('soil moisture classes '!$C$15='GEST 2.0'!$AB$2,'GEST 2.0'!AF52,IF('soil moisture classes '!$C$15='GEST 2.0'!$AH$2,'GEST 2.0'!AL52,IF('soil moisture classes '!$C$15='GEST 2.0'!$AN$2,'GEST 2.0'!AR52,IF('soil moisture classes '!$C$15='GEST 2.0'!$AT$2,'GEST 2.0'!AX52,\"\"))))))","v":18},{"$f":"IF('soil moisture classes '!$C$15='GEST 2.0'!$P$2,'GEST 2.0'!U52,IF('soil moisture classes '!$C$15='GEST 2.0'!$V$2,'GEST 2.0'!AA52,IF('soil moisture classes '!$C$15='GEST 2.0'!$AB$2,'GEST 2.0'!AG52,IF('soil moisture classes '!$C$15='GEST 2.0'!$AH$2,'GEST 2.0'!AM52,IF('soil moisture classes '!$C$15='GEST 2.0'!$AN$2,'GEST 2.0'!AS52,IF('soil moisture classes '!$C$15='GEST 2.0'!$AT$2,'GEST 2.0'!AY52,\"\"))))))","v":44.5},{"$f":"IF('soil moisture classes '!$C$16='GEST 2.0'!$P$2,'GEST 2.0'!P52,IF('soil moisture classes '!$C$16='GEST 2.0'!$V$2,'GEST 2.0'!V52,IF('soil moisture classes '!$C$16='GEST 2.0'!$AB$2,'GEST 2.0'!AB52,IF('soil moisture classes '!$C$16='GEST 2.0'!$AH$2,'GEST 2.0'!AH52,IF('soil moisture classes '!$C$16='GEST 2.0'!$AN$2,'GEST 2.0'!AN52,IF('soil moisture classes '!$C$16='GEST 2.0'!$AT$2,'GEST 2.0'!AT52,\"\"))))))","v":"S8: Very wet reeds with lateral import of organic matter"},{"$f":"IF('soil moisture classes '!$C$16='GEST 2.0'!$P$2,'GEST 2.0'!Q52,IF('soil moisture classes '!$C$16='GEST 2.0'!$V$2,'GEST 2.0'!W52,IF('soil moisture classes '!$C$16='GEST 2.0'!$AB$2,'GEST 2.0'!AC52,IF('soil moisture classes '!$C$16='GEST 2.0'!$AH$2,'GEST 2.0'!AI52,IF('soil moisture classes '!$C$16='GEST 2.0'!$AN$2,'GEST 2.0'!AO52,IF('soil moisture classes '!$C$16='GEST 2.0'!$AT$2,'GEST 2.0'!AU52,\"\"))))))","v":42.27},{"$f":"IF('soil moisture classes '!$C$16='GEST 2.0'!$P$2,'GEST 2.0'!R52,IF('soil moisture classes '!$C$16='GEST 2.0'!$V$2,'GEST 2.0'!X52,IF('soil moisture classes '!$C$16='GEST 2.0'!$AB$2,'GEST 2.0'!AD52,IF('soil moisture classes '!$C$16='GEST 2.0'!$AH$2,'GEST 2.0'!AJ52,IF('soil moisture classes '!$C$16='GEST 2.0'!$AN$2,'GEST 2.0'!AP52,IF('soil moisture classes '!$C$16='GEST 2.0'!$AT$2,'GEST 2.0'!AV52,\"\"))))))","v":18},{"$f":"IF('soil moisture classes '!$C$16='GEST 2.0'!$P$2,'GEST 2.0'!S52,IF('soil moisture classes '!$C$16='GEST 2.0'!$V$2,'GEST 2.0'!Y52,IF('soil moisture classes '!$C$16='GEST 2.0'!$AB$2,'GEST 2.0'!AE52,IF('soil moisture classes '!$C$16='GEST 2.0'!$AH$2,'GEST 2.0'!AK52,IF('soil moisture classes '!$C$16='GEST 2.0'!$AN$2,'GEST 2.0'!AQ52,IF('soil moisture classes '!$C$16='GEST 2.0'!$AT$2,'GEST 2.0'!AW52,\"\"))))))","v":2.39},{"$f":"IF('soil moisture classes '!$C$16='GEST 2.0'!$P$2,'GEST 2.0'!T52,IF('soil moisture classes '!$C$16='GEST 2.0'!$V$2,'GEST 2.0'!Z52,IF('soil moisture classes '!$C$16='GEST 2.0'!$AB$2,'GEST 2.0'!AF52,IF('soil moisture classes '!$C$16='GEST 2.0'!$AH$2,'GEST 2.0'!AL52,IF('soil moisture classes '!$C$16='GEST 2.0'!$AN$2,'GEST 2.0'!AR52,IF('soil moisture classes '!$C$16='GEST 2.0'!$AT$2,'GEST 2.0'!AX52,\"\"))))))","v":18},{"$f":"IF('soil moisture classes '!$C$16='GEST 2.0'!$P$2,'GEST 2.0'!U52,IF('soil moisture classes '!$C$16='GEST 2.0'!$V$2,'GEST 2.0'!AA52,IF('soil moisture classes '!$C$16='GEST 2.0'!$AB$2,'GEST 2.0'!AG52,IF('soil moisture classes '!$C$16='GEST 2.0'!$AH$2,'GEST 2.0'!AM52,IF('soil moisture classes '!$C$16='GEST 2.0'!$AN$2,'GEST 2.0'!AS52,IF('soil moisture classes '!$C$16='GEST 2.0'!$AT$2,'GEST 2.0'!AY52,\"\"))))))","v":44.5}]
[" :","U16","Wet bog heath",null,null,null,null,null,null,null,null,null,null,6,null,{"$f":"IF('soil moisture classes '!$C$15='GEST 2.0'!$P$2,'GEST 2.0'!P53,IF('soil moisture classes '!$C$15='GEST 2.0'!$V$2,'GEST 2.0'!V53,IF('soil moisture classes '!$C$15='GEST 2.0'!$AB$2,'GEST 2.0'!AB53,IF('soil moisture classes '!$C$15='GEST 2.0'!$AH$2,'GEST 2.0'!AH53,IF('soil moisture classes '!$C$15='GEST 2.0'!$AN$2,'GEST 2.0'!AN53,IF('soil moisture classes '!$C$15='GEST 2.0'!$AT$2,'GEST 2.0'!AT53,\"\"))))))","v":"S9: Ditches in low intensity grassland"},{"$f":"IF('soil moisture classes '!$C$15='GEST 2.0'!$P$2,'GEST 2.0'!Q53,IF('soil moisture classes '!$C$15='GEST 2.0'!$V$2,'GEST 2.0'!W53,IF('soil moisture classes '!$C$15='GEST 2.0'!$AB$2,'GEST 2.0'!AC53,IF('soil moisture classes '!$C$15='GEST 2.0'!$AH$2,'GEST 2.0'!AI53,IF('soil moisture classes '!$C$15='GEST 2.0'!$AN$2,'GEST 2.0'!AO53,IF('soil moisture classes '!$C$15='GEST 2.0'!$AT$2,'GEST 2.0'!AU53,\"\"))))))","v":3.17},{"$f":"IF('soil moisture classes '!$C$15='GEST 2.0'!$P$2,'GEST 2.0'!R53,IF('soil moisture classes '!$C$15='GEST 2.0'!$V$2,'GEST 2.0'!X53,IF('soil moisture classes '!$C$15='GEST 2.0'!$AB$2,'GEST 2.0'!AD53,IF('soil moisture classes '!$C$15='GEST 2.0'!$AH$2,'GEST 2.0'!AJ53,IF('soil moisture classes '!$C$15='GEST 2.0'!$AN$2,'GEST 2.0'!AP53,IF('soil moisture classes '!$C$15='GEST 2.0'!$AT$2,'GEST 2.0'!AV53,\"\"))))))","v":3},{"$f":"IF('soil moisture classes '!$C$15='GEST 2.0'!$P$2,'GEST 2.0'!S53,IF('soil moisture classes '!$C$15='GEST 2.0'!$V$2,'GEST 2.0'!Y53,IF('soil moisture classes '!$C$15='GEST 2.0'!$AB$2,'GEST 2.0'!AE53,IF('soil moisture classes '!$C$15='GEST 2.0'!$AH$2,'GEST 2.0'!AK53,IF('soil moisture classes '!$C$15='GEST 2.0'!$AN$2,'GEST 2.0'!AQ53,IF('soil moisture classes '!$C$15='GEST 2.0'!$AT$2,'GEST 2.0'!AW53,\"\"))))))","v":"+/- 0"},{"$f":"IF('soil moisture classes '!$C$15='GEST 2.0'!$P$2,'GEST 2.0'!T53,IF('soil moisture classes '!$C$15='GEST 2.0'!$V$2,'GEST 2.0'!Z53,IF('soil moisture classes '!$C$15='GEST 2.0'!$AB$2,'GEST 2.0'!AF53,IF('soil moisture classes '!$C$15='GEST 2.0'!$AH$2,'GEST 2.0'!AL53,IF('soil moisture classes '!$C$15='GEST 2.0'!$AN$2,'GEST 2.0'!AR53,IF('soil moisture classes '!$C$15='GEST 2.0'!$AT$2,'GEST 2.0'!AX53,\"\"))))))","v":"-"},{"$f":"IF('soil moisture classes '!$C$15='GEST 2.0'!$P$2,'GEST 2.0'!U53,IF('soil moisture classes '!$C$15='GEST 2.0'!$V$2,'GEST 2.0'!AA53,IF('soil moisture classes '!$C$15='GEST 2.0'!$AB$2,'GEST 2.0'!AG53,IF('soil moisture classes '!$C$15='GEST 2.0'!$AH$2,'GEST 2.0'!AM53,IF('soil moisture classes '!$C$15='GEST 2.0'!$AN$2,'GEST 2.0'!AS53,IF('soil moisture classes '!$C$15='GEST 2.0'!$AT$2,'GEST 2.0'!AY53,\"\"))))))","v":3},{"$f":"IF('soil moisture classes '!$C$16='GEST 2.0'!$P$2,'GEST 2.0'!P53,IF('soil moisture classes '!$C$16='GEST 2.0'!$V$2,'GEST 2.0'!V53,IF('soil moisture classes '!$C$16='GEST 2.0'!$AB$2,'GEST 2.0'!AB53,IF('soil moisture classes '!$C$16='GEST 2.0'!$AH$2,'GEST 2.0'!AH53,IF('soil moisture classes '!$C$16='GEST 2.0'!$AN$2,'GEST 2.0'!AN53,IF('soil moisture classes '!$C$16='GEST 2.0'!$AT$2,'GEST 2.0'!AT53,\"\"))))))","v":"S9: Ditches in low intensity grassland"},{"$f":"IF('soil moisture classes '!$C$16='GEST 2.0'!$P$2,'GEST 2.0'!Q53,IF('soil moisture classes '!$C$16='GEST 2.0'!$V$2,'GEST 2.0'!W53,IF('soil moisture classes '!$C$16='GEST 2.0'!$AB$2,'GEST 2.0'!AC53,IF('soil moisture classes '!$C$16='GEST 2.0'!$AH$2,'GEST 2.0'!AI53,IF('soil moisture classes '!$C$16='GEST 2.0'!$AN$2,'GEST 2.0'!AO53,IF('soil moisture classes '!$C$16='GEST 2.0'!$AT$2,'GEST 2.0'!AU53,\"\"))))))","v":3.17},{"$f":"IF('soil moisture classes '!$C$16='GEST 2.0'!$P$2,'GEST 2.0'!R53,IF('soil moisture classes '!$C$16='GEST 2.0'!$V$2,'GEST 2.0'!X53,IF('soil moisture classes '!$C$16='GEST 2.0'!$AB$2,'GEST 2.0'!AD53,IF('soil moisture classes '!$C$16='GEST 2.0'!$AH$2,'GEST 2.0'!AJ53,IF('soil moisture classes '!$C$16='GEST 2.0'!$AN$2,'GEST 2.0'!AP53,IF('soil moisture classes '!$C$16='GEST 2.0'!$AT$2,'GEST 2.0'!AV53,\"\"))))))","v":3},{"$f":"IF('soil moisture classes '!$C$16='GEST 2.0'!$P$2,'GEST 2.0'!S53,IF('soil moisture classes '!$C$16='GEST 2.0'!$V$2,'GEST 2.0'!Y53,IF('soil moisture classes '!$C$16='GEST 2.0'!$AB$2,'GEST 2.0'!AE53,IF('soil moisture classes '!$C$16='GEST 2.0'!$AH$2,'GEST 2.0'!AK53,IF('soil moisture classes '!$C$16='GEST 2.0'!$AN$2,'GEST 2.0'!AQ53,IF('soil moisture classes '!$C$16='GEST 2.0'!$AT$2,'GEST 2.0'!AW53,\"\"))))))","v":"+/- 0"},{"$f":"IF('soil moisture classes '!$C$16='GEST 2.0'!$P$2,'GEST 2.0'!T53,IF('soil moisture classes '!$C$16='GEST 2.0'!$V$2,'GEST 2.0'!Z53,IF('soil moisture classes '!$C$16='GEST 2.0'!$AB$2,'GEST 2.0'!AF53,IF('soil moisture classes '!$C$16='GEST 2.0'!$AH$2,'GEST 2.0'!AL53,IF('soil moisture classes '!$C$16='GEST 2.0'!$AN$2,'GEST 2.0'!AR53,IF('soil moisture classes '!$C$16='GEST 2.0'!$AT$2,'GEST 2.0'!AX53,\"\"))))))","v":"-"},{"$f":"IF('soil moisture classes '!$C$16='GEST 2.0'!$P$2,'GEST 2.0'!U53,IF('soil moisture classes '!$C$16='GEST 2.0'!$V$2,'GEST 2.0'!AA53,IF('soil moisture classes '!$C$16='GEST 2.0'!$AB$2,'GEST 2.0'!AG53,IF('soil moisture classes '!$C$16='GEST 2.0'!$AH$2,'GEST 2.0'!AM53,IF('soil moisture classes '!$C$16='GEST 2.0'!$AN$2,'GEST 2.0'!AS53,IF('soil moisture classes '!$C$16='GEST 2.0'!$AT$2,'GEST 2.0'!AY53,\"\"))))))","v":3}]
[" :","U17","Very wet tall sedges and Typha",null,null,null,null,null,null,null,null,null,null,7,null,{"$f":"IF('soil moisture classes '!$C$15='GEST 2.0'!$P$2,'GEST 2.0'!P54,IF('soil moisture classes '!$C$15='GEST 2.0'!$V$2,'GEST 2.0'!V54,IF('soil moisture classes '!$C$15='GEST 2.0'!$AB$2,'GEST 2.0'!AB54,IF('soil moisture classes '!$C$15='GEST 2.0'!$AH$2,'GEST 2.0'!AH54,IF('soil moisture classes '!$C$15='GEST 2.0'!$AN$2,'GEST 2.0'!AN54,IF('soil moisture classes '!$C$15='GEST 2.0'!$AT$2,'GEST 2.0'!AT54,\"\"))))))","v":"."},{"$f":"IF('soil moisture classes '!$C$15='GEST 2.0'!$P$2,'GEST 2.0'!Q54,IF('soil moisture classes '!$C$15='GEST 2.0'!$V$2,'GEST 2.0'!W54,IF('soil moisture classes '!$C$15='GEST 2.0'!$AB$2,'GEST 2.0'!AC54,IF('soil moisture classes '!$C$15='GEST 2.0'!$AH$2,'GEST 2.0'!AI54,IF('soil moisture classes '!$C$15='GEST 2.0'!$AN$2,'GEST 2.0'!AO54,IF('soil moisture classes '!$C$15='GEST 2.0'!$AT$2,'GEST 2.0'!AU54,\"\"))))))","v":"."},{"$f":"IF('soil moisture classes '!$C$15='GEST 2.0'!$P$2,'GEST 2.0'!R54,IF('soil moisture classes '!$C$15='GEST 2.0'!$V$2,'GEST 2.0'!X54,IF('soil moisture classes '!$C$15='GEST 2.0'!$AB$2,'GEST 2.0'!AD54,IF('soil moisture classes '!$C$15='GEST 2.0'!$AH$2,'GEST 2.0'!AJ54,IF('soil moisture classes '!$C$15='GEST 2.0'!$AN$2,'GEST 2.0'!AP54,IF('soil moisture classes '!$C$15='GEST 2.0'!$AT$2,'GEST 2.0'!AV54,\"\"))))))","v":"."},{"$f":"IF('soil moisture classes '!$C$15='GEST 2.0'!$P$2,'GEST 2.0'!S54,IF('soil moisture classes '!$C$15='GEST 2.0'!$V$2,'GEST 2.0'!Y54,IF('soil moisture classes '!$C$15='GEST 2.0'!$AB$2,'GEST 2.0'!AE54,IF('soil moisture classes '!$C$15='GEST 2.0'!$AH$2,'GEST 2.0'!AK54,IF('soil moisture classes '!$C$15='GEST 2.0'!$AN$2,'GEST 2.0'!AQ54,IF('soil moisture classes '!$C$15='GEST 2.0'!$AT$2,'GEST 2.0'!AW54,\"\"))))))","v":"."},{"$f":"IF('soil moisture classes '!$C$15='GEST 2.0'!$P$2,'GEST 2.0'!T54,IF('soil moisture classes '!$C$15='GEST 2.0'!$V$2,'GEST 2.0'!Z54,IF('soil moisture classes '!$C$15='GEST 2.0'!$AB$2,'GEST 2.0'!AF54,IF('soil moisture classes '!$C$15='GEST 2.0'!$AH$2,'GEST 2.0'!AL54,IF('soil moisture classes '!$C$15='GEST 2.0'!$AN$2,'GEST 2.0'!AR54,IF('soil moisture classes '!$C$15='GEST 2.0'!$AT$2,'GEST 2.0'!AX54,\"\"))))))","v":"."},{"$f":"IF('soil moisture classes '!$C$15='GEST 2.0'!$P$2,'GEST 2.0'!U54,IF('soil moisture classes '!$C$15='GEST 2.0'!$V$2,'GEST 2.0'!AA54,IF('soil moisture classes '!$C$15='GEST 2.0'!$AB$2,'GEST 2.0'!AG54,IF('soil moisture classes '!$C$15='GEST 2.0'!$AH$2,'GEST 2.0'!AM54,IF('soil moisture classes '!$C$15='GEST 2.0'!$AN$2,'GEST 2.0'!AS54,IF('soil moisture classes '!$C$15='GEST 2.0'!$AT$2,'GEST 2.0'!AY54,\"\"))))))","v":"."},{"$f":"IF('soil moisture classes '!$C$16='GEST 2.0'!$P$2,'GEST 2.0'!P54,IF('soil moisture classes '!$C$16='GEST 2.0'!$V$2,'GEST 2.0'!V54,IF('soil moisture classes '!$C$16='GEST 2.0'!$AB$2,'GEST 2.0'!AB54,IF('soil moisture classes '!$C$16='GEST 2.0'!$AH$2,'GEST 2.0'!AH54,IF('soil moisture classes '!$C$16='GEST 2.0'!$AN$2,'GEST 2.0'!AN54,IF('soil moisture classes '!$C$16='GEST 2.0'!$AT$2,'GEST 2.0'!AT54,\"\"))))))","v":"."},{"$f":"IF('soil moisture classes '!$C$16='GEST 2.0'!$P$2,'GEST 2.0'!Q54,IF('soil moisture classes '!$C$16='GEST 2.0'!$V$2,'GEST 2.0'!W54,IF('soil moisture classes '!$C$16='GEST 2.0'!$AB$2,'GEST 2.0'!AC54,IF('soil moisture classes '!$C$16='GEST 2.0'!$AH$2,'GEST 2.0'!AI54,IF('soil moisture classes '!$C$16='GEST 2.0'!$AN$2,'GEST 2.0'!AO54,IF('soil moisture classes '!$C$16='GEST 2.0'!$AT$2,'GEST 2.0'!AU54,\"\"))))))","v":"."},{"$f":"IF('soil moisture classes '!$C$16='GEST 2.0'!$P$2,'GEST 2.0'!R54,IF('soil moisture classes '!$C$16='GEST 2.0'!$V$2,'GEST 2.0'!X54,IF('soil moisture classes '!$C$16='GEST 2.0'!$AB$2,'GEST 2.0'!AD54,IF('soil moisture classes '!$C$16='GEST 2.0'!$AH$2,'GEST 2.0'!AJ54,IF('soil moisture classes '!$C$16='GEST 2.0'!$AN$2,'GEST 2.0'!AP54,IF('soil moisture classes '!$C$16='GEST 2.0'!$AT$2,'GEST 2.0'!AV54,\"\"))))))","v":"."},{"$f":"IF('soil moisture classes '!$C$16='GEST 2.0'!$P$2,'GEST 2.0'!S54,IF('soil moisture classes '!$C$16='GEST 2.0'!$V$2,'GEST 2.0'!Y54,IF('soil moisture classes '!$C$16='GEST 2.0'!$AB$2,'GEST 2.0'!AE54,IF('soil moisture classes '!$C$16='GEST 2.0'!$AH$2,'GEST 2.0'!AK54,IF('soil moisture classes '!$C$16='GEST 2.0'!$AN$2,'GEST 2.0'!AQ54,IF('soil moisture classes '!$C$16='GEST 2.0'!$AT$2,'GEST 2.0'!AW54,\"\"))))))","v":"."},{"$f":"IF('soil moisture classes '!$C$16='GEST 2.0'!$P$2,'GEST 2.0'!T54,IF('soil moisture classes '!$C$16='GEST 2.0'!$V$2,'GEST 2.0'!Z54,IF('soil moisture classes '!$C$16='GEST 2.0'!$AB$2,'GEST 2.0'!AF54,IF('soil moisture classes '!$C$16='GEST 2.0'!$AH$2,'GEST 2.0'!AL54,IF('soil moisture classes '!$C$16='GEST 2.0'!$AN$2,'GEST 2.0'!AR54,IF('soil moisture classes '!$C$16='GEST 2.0'!$AT$2,'GEST 2.0'!AX54,\"\"))))))","v":"."},{"$f":"IF('soil moisture classes '!$C$16='GEST 2.0'!$P$2,'GEST 2.0'!U54,IF('soil moisture classes '!$C$16='GEST 2.0'!$V$2,'GEST 2.0'!AA54,IF('soil moisture classes '!$C$16='GEST 2.0'!$AB$2,'GEST 2.0'!AG54,IF('soil moisture classes '!$C$16='GEST 2.0'!$AH$2,'GEST 2.0'!AM54,IF('soil moisture classes '!$C$16='GEST 2.0'!$AN$2,'GEST 2.0'!AS54,IF('soil moisture classes '!$C$16='GEST 2.0'!$AT$2,'GEST 2.0'!AY54,\"\"))))))","v":"."}]
[" :","U18","Very wet Phragmites reeds",null,null,null,null,null,null,null,null,null,null,8,null,{"$f":"IF('soil moisture classes '!$C$15='GEST 2.0'!$P$2,'GEST 2.0'!P55,IF('soil moisture classes '!$C$15='GEST 2.0'!$V$2,'GEST 2.0'!V55,IF('soil moisture classes '!$C$15='GEST 2.0'!$AB$2,'GEST 2.0'!AB55,IF('soil moisture classes '!$C$15='GEST 2.0'!$AH$2,'GEST 2.0'!AH55,IF('soil moisture classes '!$C$15='GEST 2.0'!$AN$2,'GEST 2.0'!AN55,IF('soil moisture classes '!$C$15='GEST 2.0'!$AT$2,'GEST 2.0'!AT55,\"\"))))))","v":"."},{"$f":"IF('soil moisture classes '!$C$15='GEST 2.0'!$P$2,'GEST 2.0'!Q55,IF('soil moisture classes '!$C$15='GEST 2.0'!$V$2,'GEST 2.0'!W55,IF('soil moisture classes '!$C$15='GEST 2.0'!$AB$2,'GEST 2.0'!AC55,IF('soil moisture classes '!$C$15='GEST 2.0'!$AH$2,'GEST 2.0'!AI55,IF('soil moisture classes '!$C$15='GEST 2.0'!$AN$2,'GEST 2.0'!AO55,IF('soil moisture classes '!$C$15='GEST 2.0'!$AT$2,'GEST 2.0'!AU55,\"\"))))))","v":"."},{"$f":"IF('soil moisture classes '!$C$15='GEST 2.0'!$P$2,'GEST 2.0'!R55,IF('soil moisture classes '!$C$15='GEST 2.0'!$V$2,'GEST 2.0'!X55,IF('soil moisture classes '!$C$15='GEST 2.0'!$AB$2,'GEST 2.0'!AD55,IF('soil moisture classes '!$C$15='GEST 2.0'!$AH$2,'GEST 2.0'!AJ55,IF('soil moisture classes '!$C$15='GEST 2.0'!$AN$2,'GEST 2.0'!AP55,IF('soil moisture classes '!$C$15='GEST 2.0'!$AT$2,'GEST 2.0'!AV55,\"\"))))))","v":"."},{"$f":"IF('soil moisture classes '!$C$15='GEST 2.0'!$P$2,'GEST 2.0'!S55,IF('soil moisture classes '!$C$15='GEST 2.0'!$V$2,'GEST 2.0'!Y55,IF('soil moisture classes '!$C$15='GEST 2.0'!$AB$2,'GEST 2.0'!AE55,IF('soil moisture classes '!$C$15='GEST 2.0'!$AH$2,'GEST 2.0'!AK55,IF('soil moisture classes '!$C$15='GEST 2.0'!$AN$2,'GEST 2.0'!AQ55,IF('soil moisture classes '!$C$15='GEST 2.0'!$AT$2,'GEST 2.0'!AW55,\"\"))))))","v":"."},{"$f":"IF('soil moisture classes '!$C$15='GEST 2.0'!$P$2,'GEST 2.0'!T55,IF('soil moisture classes '!$C$15='GEST 2.0'!$V$2,'GEST 2.0'!Z55,IF('soil moisture classes '!$C$15='GEST 2.0'!$AB$2,'GEST 2.0'!AF55,IF('soil moisture classes '!$C$15='GEST 2.0'!$AH$2,'GEST 2.0'!AL55,IF('soil moisture classes '!$C$15='GEST 2.0'!$AN$2,'GEST 2.0'!AR55,IF('soil moisture classes '!$C$15='GEST 2.0'!$AT$2,'GEST 2.0'!AX55,\"\"))))))","v":"."},{"$f":"IF('soil moisture classes '!$C$15='GEST 2.0'!$P$2,'GEST 2.0'!U55,IF('soil moisture classes '!$C$15='GEST 2.0'!$V$2,'GEST 2.0'!AA55,IF('soil moisture classes '!$C$15='GEST 2.0'!$AB$2,'GEST 2.0'!AG55,IF('soil moisture classes '!$C$15='GEST 2.0'!$AH$2,'GEST 2.0'!AM55,IF('soil moisture classes '!$C$15='GEST 2.0'!$AN$2,'GEST 2.0'!AS55,IF('soil moisture classes '!$C$15='GEST 2.0'!$AT$2,'GEST 2.0'!AY55,\"\"))))))","v":"."},{"$f":"IF('soil moisture classes '!$C$16='GEST 2.0'!$P$2,'GEST 2.0'!P55,IF('soil moisture classes '!$C$16='GEST 2.0'!$V$2,'GEST 2.0'!V55,IF('soil moisture classes '!$C$16='GEST 2.0'!$AB$2,'GEST 2.0'!AB55,IF('soil moisture classes '!$C$16='GEST 2.0'!$AH$2,'GEST 2.0'!AH55,IF('soil moisture classes '!$C$16='GEST 2.0'!$AN$2,'GEST 2.0'!AN55,IF('soil moisture classes '!$C$16='GEST 2.0'!$AT$2,'GEST 2.0'!AT55,\"\"))))))","v":"."},{"$f":"IF('soil moisture classes '!$C$16='GEST 2.0'!$P$2,'GEST 2.0'!Q55,IF('soil moisture classes '!$C$16='GEST 2.0'!$V$2,'GEST 2.0'!W55,IF('soil moisture classes '!$C$16='GEST 2.0'!$AB$2,'GEST 2.0'!AC55,IF('soil moisture classes '!$C$16='GEST 2.0'!$AH$2,'GEST 2.0'!AI55,IF('soil moisture classes '!$C$16='GEST 2.0'!$AN$2,'GEST 2.0'!AO55,IF('soil moisture classes '!$C$16='GEST 2.0'!$AT$2,'GEST 2.0'!AU55,\"\"))))))","v":"."},{"$f":"IF('soil moisture classes '!$C$16='GEST 2.0'!$P$2,'GEST 2.0'!R55,IF('soil moisture classes '!$C$16='GEST 2.0'!$V$2,'GEST 2.0'!X55,IF('soil moisture classes '!$C$16='GEST 2.0'!$AB$2,'GEST 2.0'!AD55,IF('soil moisture classes '!$C$16='GEST 2.0'!$AH$2,'GEST 2.0'!AJ55,IF('soil moisture classes '!$C$16='GEST 2.0'!$AN$2,'GEST 2.0'!AP55,IF('soil moisture classes '!$C$16='GEST 2.0'!$AT$2,'GEST 2.0'!AV55,\"\"))))))","v":"."},{"$f":"IF('soil moisture classes '!$C$16='GEST 2.0'!$P$2,'GEST 2.0'!S55,IF('soil moisture classes '!$C$16='GEST 2.0'!$V$2,'GEST 2.0'!Y55,IF('soil moisture classes '!$C$16='GEST 2.0'!$AB$2,'GEST 2.0'!AE55,IF('soil moisture classes '!$C$16='GEST 2.0'!$AH$2,'GEST 2.0'!AK55,IF('soil moisture classes '!$C$16='GEST 2.0'!$AN$2,'GEST 2.0'!AQ55,IF('soil moisture classes '!$C$16='GEST 2.0'!$AT$2,'GEST 2.0'!AW55,\"\"))))))","v":"."},{"$f":"IF('soil moisture classes '!$C$16='GEST 2.0'!$P$2,'GEST 2.0'!T55,IF('soil moisture classes '!$C$16='GEST 2.0'!$V$2,'GEST 2.0'!Z55,IF('soil moisture classes '!$C$16='GEST 2.0'!$AB$2,'GEST 2.0'!AF55,IF('soil moisture classes '!$C$16='GEST 2.0'!$AH$2,'GEST 2.0'!AL55,IF('soil moisture classes '!$C$16='GEST 2.0'!$AN$2,'GEST 2.0'!AR55,IF('soil moisture classes '!$C$16='GEST 2.0'!$AT$2,'GEST 2.0'!AX55,\"\"))))))","v":"."},{"$f":"IF('soil moisture classes '!$C$16='GEST 2.0'!$P$2,'GEST 2.0'!U55,IF('soil moisture classes '!$C$16='GEST 2.0'!$V$2,'GEST 2.0'!AA55,IF('soil moisture classes '!$C$16='GEST 2.0'!$AB$2,'GEST 2.0'!AG55,IF('soil moisture classes '!$C$16='GEST 2.0'!$AH$2,'GEST 2.0'!AM55,IF('soil moisture classes '!$C$16='GEST 2.0'!$AN$2,'GEST 2.0'!AS55,IF('soil moisture classes '!$C$16='GEST 2.0'!$AT$2,'GEST 2.0'!AY55,\"\"))))))","v":"."}]
[" :","U19","Wet to very wet Sphagnum hollows",null,null,null,null,null,null,null,null,null,null,9,null,{"$f":"IF('soil moisture classes '!$C$15='GEST 2.0'!$P$2,'GEST 2.0'!P56,IF('soil moisture classes '!$C$15='GEST 2.0'!$V$2,'GEST 2.0'!V56,IF('soil moisture classes '!$C$15='GEST 2.0'!$AB$2,'GEST 2.0'!AB56,IF('soil moisture classes '!$C$15='GEST 2.0'!$AH$2,'GEST 2.0'!AH56,IF('soil moisture classes '!$C$15='GEST 2.0'!$AN$2,'GEST 2.0'!AN56,IF('soil moisture classes '!$C$15='GEST 2.0'!$AT$2,'GEST 2.0'!AT56,\"\"))))))","v":"."},{"$f":"IF('soil moisture classes '!$C$15='GEST 2.0'!$P$2,'GEST 2.0'!Q56,IF('soil moisture classes '!$C$15='GEST 2.0'!$V$2,'GEST 2.0'!W56,IF('soil moisture classes '!$C$15='GEST 2.0'!$AB$2,'GEST 2.0'!AC56,IF('soil moisture classes '!$C$15='GEST 2.0'!$AH$2,'GEST 2.0'!AI56,IF('soil moisture classes '!$C$15='GEST 2.0'!$AN$2,'GEST 2.0'!AO56,IF('soil moisture classes '!$C$15='GEST 2.0'!$AT$2,'GEST 2.0'!AU56,\"\"))))))","v":"."},{"$f":"IF('soil moisture classes '!$C$15='GEST 2.0'!$P$2,'GEST 2.0'!R56,IF('soil moisture classes '!$C$15='GEST 2.0'!$V$2,'GEST 2.0'!X56,IF('soil moisture classes '!$C$15='GEST 2.0'!$AB$2,'GEST 2.0'!AD56,IF('soil moisture classes '!$C$15='GEST 2.0'!$AH$2,'GEST 2.0'!AJ56,IF('soil moisture classes '!$C$15='GEST 2.0'!$AN$2,'GEST 2.0'!AP56,IF('soil moisture classes '!$C$15='GEST 2.0'!$AT$2,'GEST 2.0'!AV56,\"\"))))))","v":"."},{"$f":"IF('soil moisture classes '!$C$15='GEST 2.0'!$P$2,'GEST 2.0'!S56,IF('soil moisture classes '!$C$15='GEST 2.0'!$V$2,'GEST 2.0'!Y56,IF('soil moisture classes '!$C$15='GEST 2.0'!$AB$2,'GEST 2.0'!AE56,IF('soil moisture classes '!$C$15='GEST 2.0'!$AH$2,'GEST 2.0'!AK56,IF('soil moisture classes '!$C$15='GEST 2.0'!$AN$2,'GEST 2.0'!AQ56,IF('soil moisture classes '!$C$15='GEST 2.0'!$AT$2,'GEST 2.0'!AW56,\"\"))))))","v":"."},{"$f":"IF('soil moisture classes '!$C$15='GEST 2.0'!$P$2,'GEST 2.0'!T56,IF('soil moisture classes '!$C$15='GEST 2.0'!$V$2,'GEST 2.0'!Z56,IF('soil moisture classes '!$C$15='GEST 2.0'!$AB$2,'GEST 2.0'!AF56,IF('soil moisture classes '!$C$15='GEST 2.0'!$AH$2,'GEST 2.0'!AL56,IF('soil moisture classes '!$C$15='GEST 2.0'!$AN$2,'GEST 2.0'!AR56,IF('soil moisture classes '!$C$15='GEST 2.0'!$AT$2,'GEST 2.0'!AX56,\"\"))))))","v":"."},{"$f":"IF('soil moisture classes '!$C$15='GEST 2.0'!$P$2,'GEST 2.0'!U56,IF('soil moisture classes '!$C$15='GEST 2.0'!$V$2,'GEST 2.0'!AA56,IF('soil moisture classes '!$C$15='GEST 2.0'!$AB$2,'GEST 2.0'!AG56,IF('soil moisture classes '!$C$15='GEST 2.0'!$AH$2,'GEST 2.0'!AM56,IF('soil moisture classes '!$C$15='GEST 2.0'!$AN$2,'GEST 2.0'!AS56,IF('soil moisture classes '!$C$15='GEST 2.0'!$AT$2,'GEST 2.0'!AY56,\"\"))))))","v":"."},{"$f":"IF('soil moisture classes '!$C$16='GEST 2.0'!$P$2,'GEST 2.0'!P56,IF('soil moisture classes '!$C$16='GEST 2.0'!$V$2,'GEST 2.0'!V56,IF('soil moisture classes '!$C$16='GEST 2.0'!$AB$2,'GEST 2.0'!AB56,IF('soil moisture classes '!$C$16='GEST 2.0'!$AH$2,'GEST 2.0'!AH56,IF('soil moisture classes '!$C$16='GEST 2.0'!$AN$2,'GEST 2.0'!AN56,IF('soil moisture classes '!$C$16='GEST 2.0'!$AT$2,'GEST 2.0'!AT56,\"\"))))))","v":"."},{"$f":"IF('soil moisture classes '!$C$16='GEST 2.0'!$P$2,'GEST 2.0'!Q56,IF('soil moisture classes '!$C$16='GEST 2.0'!$V$2,'GEST 2.0'!W56,IF('soil moisture classes '!$C$16='GEST 2.0'!$AB$2,'GEST 2.0'!AC56,IF('soil moisture classes '!$C$16='GEST 2.0'!$AH$2,'GEST 2.0'!AI56,IF('soil moisture classes '!$C$16='GEST 2.0'!$AN$2,'GEST 2.0'!AO56,IF('soil moisture classes '!$C$16='GEST 2.0'!$AT$2,'GEST 2.0'!AU56,\"\"))))))","v":"."},{"$f":"IF('soil moisture classes '!$C$16='GEST 2.0'!$P$2,'GEST 2.0'!R56,IF('soil moisture classes '!$C$16='GEST 2.0'!$V$2,'GEST 2.0'!X56,IF('soil moisture classes '!$C$16='GEST 2.0'!$AB$2,'GEST 2.0'!AD56,IF('soil moisture classes '!$C$16='GEST 2.0'!$AH$2,'GEST 2.0'!AJ56,IF('soil moisture classes '!$C$16='GEST 2.0'!$AN$2,'GEST 2.0'!AP56,IF('soil moisture classes '!$C$16='GEST 2.0'!$AT$2,'GEST 2.0'!AV56,\"\"))))))","v":"."},{"$f":"IF('soil moisture classes '!$C$16='GEST 2.0'!$P$2,'GEST 2.0'!S56,IF('soil moisture classes '!$C$16='GEST 2.0'!$V$2,'GEST 2.0'!Y56,IF('soil moisture classes '!$C$16='GEST 2.0'!$AB$2,'GEST 2.0'!AE56,IF('soil moisture classes '!$C$16='GEST 2.0'!$AH$2,'GEST 2.0'!AK56,IF('soil moisture classes '!$C$16='GEST 2.0'!$AN$2,'GEST 2.0'!AQ56,IF('soil moisture classes '!$C$16='GEST 2.0'!$AT$2,'GEST 2.0'!AW56,\"\"))))))","v":"."},{"$f":"IF('soil moisture classes '!$C$16='GEST 2.0'!$P$2,'GEST 2.0'!T56,IF('soil moisture classes '!$C$16='GEST 2.0'!$V$2,'GEST 2.0'!Z56,IF('soil moisture classes '!$C$16='GEST 2.0'!$AB$2,'GEST 2.0'!AF56,IF('soil moisture classes '!$C$16='GEST 2.0'!$AH$2,'GEST 2.0'!AL56,IF('soil moisture classes '!$C$16='GEST 2.0'!$AN$2,'GEST 2.0'!AR56,IF('soil moisture classes '!$C$16='GEST 2.0'!$AT$2,'GEST 2.0'!AX56,\"\"))))))","v":"."},{"$f":"IF('soil moisture classes '!$C$16='GEST 2.0'!$P$2,'GEST 2.0'!U56,IF('soil moisture classes '!$C$16='GEST 2.0'!$V$2,'GEST 2.0'!AA56,IF('soil moisture classes '!$C$16='GEST 2.0'!$AB$2,'GEST 2.0'!AG56,IF('soil moisture classes '!$C$16='GEST 2.0'!$AH$2,'GEST 2.0'!AM56,IF('soil moisture classes '!$C$16='GEST 2.0'!$AN$2,'GEST 2.0'!AS56,IF('soil moisture classes '!$C$16='GEST 2.0'!$AT$2,'GEST 2.0'!AY56,\"\"))))))","v":"."}]
[" :","U20","Flooded tall reeds (> 20 cm above surface)",null,null,null,null,null,null,null,null,null,null,10,null,{"$f":"IF('soil moisture classes '!$C$15='GEST 2.0'!$P$2,'GEST 2.0'!P57,IF('soil moisture classes '!$C$15='GEST 2.0'!$V$2,'GEST 2.0'!V57,IF('soil moisture classes '!$C$15='GEST 2.0'!$AB$2,'GEST 2.0'!AB57,IF('soil moisture classes '!$C$15='GEST 2.0'!$AH$2,'GEST 2.0'!AH57,IF('soil moisture classes '!$C$15='GEST 2.0'!$AN$2,'GEST 2.0'!AN57,IF('soil moisture classes '!$C$15='GEST 2.0'!$AT$2,'GEST 2.0'!AT57,\"\"))))))","v":"."},{"$f":"IF('soil moisture classes '!$C$15='GEST 2.0'!$P$2,'GEST 2.0'!Q57,IF('soil moisture classes '!$C$15='GEST 2.0'!$V$2,'GEST 2.0'!W57,IF('soil moisture classes '!$C$15='GEST 2.0'!$AB$2,'GEST 2.0'!AC57,IF('soil moisture classes '!$C$15='GEST 2.0'!$AH$2,'GEST 2.0'!AI57,IF('soil moisture classes '!$C$15='GEST 2.0'!$AN$2,'GEST 2.0'!AO57,IF('soil moisture classes '!$C$15='GEST 2.0'!$AT$2,'GEST 2.0'!AU57,\"\"))))))","v":"."},{"$f":"IF('soil moisture classes '!$C$15='GEST 2.0'!$P$2,'GEST 2.0'!R57,IF('soil moisture classes '!$C$15='GEST 2.0'!$V$2,'GEST 2.0'!X57,IF('soil moisture classes '!$C$15='GEST 2.0'!$AB$2,'GEST 2.0'!AD57,IF('soil moisture classes '!$C$15='GEST 2.0'!$AH$2,'GEST 2.0'!AJ57,IF('soil moisture classes '!$C$15='GEST 2.0'!$AN$2,'GEST 2.0'!AP57,IF('soil moisture classes '!$C$15='GEST 2.0'!$AT$2,'GEST 2.0'!AV57,\"\"))))))","v":"."},{"$f":"IF('soil moisture classes '!$C$15='GEST 2.0'!$P$2,'GEST 2.0'!S57,IF('soil moisture classes '!$C$15='GEST 2.0'!$V$2,'GEST 2.0'!Y57,IF('soil moisture classes '!$C$15='GEST 2.0'!$AB$2,'GEST 2.0'!AE57,IF('soil moisture classes '!$C$15='GEST 2.0'!$AH$2,'GEST 2.0'!AK57,IF('soil moisture classes '!$C$15='GEST 2.0'!$AN$2,'GEST 2.0'!AQ57,IF('soil moisture classes '!$C$15='GEST 2.0'!$AT$2,'GEST 2.0'!AW57,\"\"))))))","v":"."},{"$f":"IF('soil moisture classes '!$C$15='GEST 2.0'!$P$2,'GEST 2.0'!T57,IF('soil moisture classes '!$C$15='GEST 2.0'!$V$2,'GEST 2.0'!Z57,IF('soil moisture classes '!$C$15='GEST 2.0'!$AB$2,'GEST 2.0'!AF57,IF('soil moisture classes '!$C$15='GEST 2.0'!$AH$2,'GEST 2.0'!AL57,IF('soil moisture classes '!$C$15='GEST 2.0'!$AN$2,'GEST 2.0'!AR57,IF('soil moisture classes '!$C$15='GEST 2.0'!$AT$2,'GEST 2.0'!AX57,\"\"))))))","v":"."},{"$f":"IF('soil moisture classes '!$C$15='GEST 2.0'!$P$2,'GEST 2.0'!U57,IF('soil moisture classes '!$C$15='GEST 2.0'!$V$2,'GEST 2.0'!AA57,IF('soil moisture classes '!$C$15='GEST 2.0'!$AB$2,'GEST 2.0'!AG57,IF('soil moisture classes '!$C$15='GEST 2.0'!$AH$2,'GEST 2.0'!AM57,IF('soil moisture classes '!$C$15='GEST 2.0'!$AN$2,'GEST 2.0'!AS57,IF('soil moisture classes '!$C$15='GEST 2.0'!$AT$2,'GEST 2.0'!AY57,\"\"))))))","v":"."},{"$f":"IF('soil moisture classes '!$C$16='GEST 2.0'!$P$2,'GEST 2.0'!P57,IF('soil moisture classes '!$C$16='GEST 2.0'!$V$2,'GEST 2.0'!V57,IF('soil moisture classes '!$C$16='GEST 2.0'!$AB$2,'GEST 2.0'!AB57,IF('soil moisture classes '!$C$16='GEST 2.0'!$AH$2,'GEST 2.0'!AH57,IF('soil moisture classes '!$C$16='GEST 2.0'!$AN$2,'GEST 2.0'!AN57,IF('soil moisture classes '!$C$16='GEST 2.0'!$AT$2,'GEST 2.0'!AT57,\"\"))))))","v":"."},{"$f":"IF('soil moisture classes '!$C$16='GEST 2.0'!$P$2,'GEST 2.0'!Q57,IF('soil moisture classes '!$C$16='GEST 2.0'!$V$2,'GEST 2.0'!W57,IF('soil moisture classes '!$C$16='GEST 2.0'!$AB$2,'GEST 2.0'!AC57,IF('soil moisture classes '!$C$16='GEST 2.0'!$AH$2,'GEST 2.0'!AI57,IF('soil moisture classes '!$C$16='GEST 2.0'!$AN$2,'GEST 2.0'!AO57,IF('soil moisture classes '!$C$16='GEST 2.0'!$AT$2,'GEST 2.0'!AU57,\"\"))))))","v":"."},{"$f":"IF('soil moisture classes '!$C$16='GEST 2.0'!$P$2,'GEST 2.0'!R57,IF('soil moisture classes '!$C$16='GEST 2.0'!$V$2,'GEST 2.0'!X57,IF('soil moisture classes '!$C$16='GEST 2.0'!$AB$2,'GEST 2.0'!AD57,IF('soil moisture classes '!$C$16='GEST 2.0'!$AH$2,'GEST 2.0'!AJ57,IF('soil moisture classes '!$C$16='GEST 2.0'!$AN$2,'GEST 2.0'!AP57,IF('soil moisture classes '!$C$16='GEST 2.0'!$AT$2,'GEST 2.0'!AV57,\"\"))))))","v":"."},{"$f":"IF('soil moisture classes '!$C$16='GEST 2.0'!$P$2,'GEST 2.0'!S57,IF('soil moisture classes '!$C$16='GEST 2.0'!$V$2,'GEST 2.0'!Y57,IF('soil moisture classes '!$C$16='GEST 2.0'!$AB$2,'GEST 2.0'!AE57,IF('soil moisture classes '!$C$16='GEST 2.0'!$AH$2,'GEST 2.0'!AK57,IF('soil moisture classes '!$C$16='GEST 2.0'!$AN$2,'GEST 2.0'!AQ57,IF('soil moisture classes '!$C$16='GEST 2.0'!$AT$2,'GEST 2.0'!AW57,\"\"))))))","v":"."},{"$f":"IF('soil moisture classes '!$C$16='GEST 2.0'!$P$2,'GEST 2.0'!T57,IF('soil moisture classes '!$C$16='GEST 2.0'!$V$2,'GEST 2.0'!Z57,IF('soil moisture classes '!$C$16='GEST 2.0'!$AB$2,'GEST 2.0'!AF57,IF('soil moisture classes '!$C$16='GEST 2.0'!$AH$2,'GEST 2.0'!AL57,IF('soil moisture classes '!$C$16='GEST 2.0'!$AN$2,'GEST 2.0'!AR57,IF('soil moisture classes '!$C$16='GEST 2.0'!$AT$2,'GEST 2.0'!AX57,\"\"))))))","v":"."},{"$f":"IF('soil moisture classes '!$C$16='GEST 2.0'!$P$2,'GEST 2.0'!U57,IF('soil moisture classes '!$C$16='GEST 2.0'!$V$2,'GEST 2.0'!AA57,IF('soil moisture classes '!$C$16='GEST 2.0'!$AB$2,'GEST 2.0'!AG57,IF('soil moisture classes '!$C$16='GEST 2.0'!$AH$2,'GEST 2.0'!AM57,IF('soil moisture classes '!$C$16='GEST 2.0'!$AN$2,'GEST 2.0'!AS57,IF('soil moisture classes '!$C$16='GEST 2.0'!$AT$2,'GEST 2.0'!AY57,\"\"))))))","v":"."}]
[" :","S1","Dry to moderately moist grassland on peaty soils (Anmoor)",null,null,null,null,null,null,null,null,null,null,11,null,{"$f":"IF('soil moisture classes '!$C$15='GEST 2.0'!$P$2,'GEST 2.0'!P58,IF('soil moisture classes '!$C$15='GEST 2.0'!$V$2,'GEST 2.0'!V58,IF('soil moisture classes '!$C$15='GEST 2.0'!$AB$2,'GEST 2.0'!AB58,IF('soil moisture classes '!$C$15='GEST 2.0'!$AH$2,'GEST 2.0'!AH58,IF('soil moisture classes '!$C$15='GEST 2.0'!$AN$2,'GEST 2.0'!AN58,IF('soil moisture classes '!$C$15='GEST 2.0'!$AT$2,'GEST 2.0'!AT58,\"\"))))))","v":"."},{"$f":"IF('soil moisture classes '!$C$15='GEST 2.0'!$P$2,'GEST 2.0'!Q58,IF('soil moisture classes '!$C$15='GEST 2.0'!$V$2,'GEST 2.0'!W58,IF('soil moisture classes '!$C$15='GEST 2.0'!$AB$2,'GEST 2.0'!AC58,IF('soil moisture classes '!$C$15='GEST 2.0'!$AH$2,'GEST 2.0'!AI58,IF('soil moisture classes '!$C$15='GEST 2.0'!$AN$2,'GEST 2.0'!AO58,IF('soil moisture classes '!$C$15='GEST 2.0'!$AT$2,'GEST 2.0'!AU58,\"\"))))))","v":"."},{"$f":"IF('soil moisture classes '!$C$15='GEST 2.0'!$P$2,'GEST 2.0'!R58,IF('soil moisture classes '!$C$15='GEST 2.0'!$V$2,'GEST 2.0'!X58,IF('soil moisture classes '!$C$15='GEST 2.0'!$AB$2,'GEST 2.0'!AD58,IF('soil moisture classes '!$C$15='GEST 2.0'!$AH$2,'GEST 2.0'!AJ58,IF('soil moisture classes '!$C$15='GEST 2.0'!$AN$2,'GEST 2.0'!AP58,IF('soil moisture classes '!$C$15='GEST 2.0'!$AT$2,'GEST 2.0'!AV58,\"\"))))))","v":"."},{"$f":"IF('soil moisture classes '!$C$15='GEST 2.0'!$P$2,'GEST 2.0'!S58,IF('soil moisture classes '!$C$15='GEST 2.0'!$V$2,'GEST 2.0'!Y58,IF('soil moisture classes '!$C$15='GEST 2.0'!$AB$2,'GEST 2.0'!AE58,IF('soil moisture classes '!$C$15='GEST 2.0'!$AH$2,'GEST 2.0'!AK58,IF('soil moisture classes '!$C$15='GEST 2.0'!$AN$2,'GEST 2.0'!AQ58,IF('soil moisture classes '!$C$15='GEST 2.0'!$AT$2,'GEST 2.0'!AW58,\"\"))))))","v":"."},{"$f":"IF('soil moisture classes '!$C$15='GEST 2.0'!$P$2,'GEST 2.0'!T58,IF('soil moisture classes '!$C$15='GEST 2.0'!$V$2,'GEST 2.0'!Z58,IF('soil moisture classes '!$C$15='GEST 2.0'!$AB$2,'GEST 2.0'!AF58,IF('soil moisture classes '!$C$15='GEST 2.0'!$AH$2,'GEST 2.0'!AL58,IF('soil moisture classes '!$C$15='GEST 2.0'!$AN$2,'GEST 2.0'!AR58,IF('soil moisture classes '!$C$15='GEST 2.0'!$AT$2,'GEST 2.0'!AX58,\"\"))))))","v":"."},{"$f":"IF('soil moisture classes '!$C$15='GEST 2.0'!$P$2,'GEST 2.0'!U58,IF('soil moisture classes '!$C$15='GEST 2.0'!$V$2,'GEST 2.0'!AA58,IF('soil moisture classes '!$C$15='GEST 2.0'!$AB$2,'GEST 2.0'!AG58,IF('soil moisture classes '!$C$15='GEST 2.0'!$AH$2,'GEST 2.0'!AM58,IF('soil moisture classes '!$C$15='GEST 2.0'!$AN$2,'GEST 2.0'!AS58,IF('soil moisture classes '!$C$15='GEST 2.0'!$AT$2,'GEST 2.0'!AY58,\"\"))))))","v":"."},{"$f":"IF('soil moisture classes '!$C$16='GEST 2.0'!$P$2,'GEST 2.0'!P58,IF('soil moisture classes '!$C$16='GEST 2.0'!$V$2,'GEST 2.0'!V58,IF('soil moisture classes '!$C$16='GEST 2.0'!$AB$2,'GEST 2.0'!AB58,IF('soil moisture classes '!$C$16='GEST 2.0'!$AH$2,'GEST 2.0'!AH58,IF('soil moisture classes '!$C$16='GEST 2.0'!$AN$2,'GEST 2.0'!AN58,IF('soil moisture classes '!$C$16='GEST 2.0'!$AT$2,'GEST 2.0'!AT58,\"\"))))))","v":"."},{"$f":"IF('soil moisture classes '!$C$16='GEST 2.0'!$P$2,'GEST 2.0'!Q58,IF('soil moisture classes '!$C$16='GEST 2.0'!$V$2,'GEST 2.0'!W58,IF('soil moisture classes '!$C$16='GEST 2.0'!$AB$2,'GEST 2.0'!AC58,IF('soil moisture classes '!$C$16='GEST 2.0'!$AH$2,'GEST 2.0'!AI58,IF('soil moisture classes '!$C$16='GEST 2.0'!$AN$2,'GEST 2.0'!AO58,IF('soil moisture classes '!$C$16='GEST 2.0'!$AT$2,'GEST 2.0'!AU58,\"\"))))))","v":"."},{"$f":"IF('soil moisture classes '!$C$16='GEST 2.0'!$P$2,'GEST 2.0'!R58,IF('soil moisture classes '!$C$16='GEST 2.0'!$V$2,'GEST 2.0'!X58,IF('soil moisture classes '!$C$16='GEST 2.0'!$AB$2,'GEST 2.0'!AD58,IF('soil moisture classes '!$C$16='GEST 2.0'!$AH$2,'GEST 2.0'!AJ58,IF('soil moisture classes '!$C$16='GEST 2.0'!$AN$2,'GEST 2.0'!AP58,IF('soil moisture classes '!$C$16='GEST 2.0'!$AT$2,'GEST 2.0'!AV58,\"\"))))))","v":"."},{"$f":"IF('soil moisture classes '!$C$16='GEST 2.0'!$P$2,'GEST 2.0'!S58,IF('soil moisture classes '!$C$16='GEST 2.0'!$V$2,'GEST 2.0'!Y58,IF('soil moisture classes '!$C$16='GEST 2.0'!$AB$2,'GEST 2.0'!AE58,IF('soil moisture classes '!$C$16='GEST 2.0'!$AH$2,'GEST 2.0'!AK58,IF('soil moisture classes '!$C$16='GEST 2.0'!$AN$2,'GEST 2.0'!AQ58,IF('soil moisture classes '!$C$16='GEST 2.0'!$AT$2,'GEST 2.0'!AW58,\"\"))))))","v":"."},{"$f":"IF('soil moisture classes '!$C$16='GEST 2.0'!$P$2,'GEST 2.0'!T58,IF('soil moisture classes '!$C$16='GEST 2.0'!$V$2,'GEST 2.0'!Z58,IF('soil moisture classes '!$C$16='GEST 2.0'!$AB$2,'GEST 2.0'!AF58,IF('soil moisture classes '!$C$16='GEST 2.0'!$AH$2,'GEST 2.0'!AL58,IF('soil moisture classes '!$C$16='GEST 2.0'!$AN$2,'GEST 2.0'!AR58,IF('soil moisture classes '!$C$16='GEST 2.0'!$AT$2,'GEST 2.0'!AX58,\"\"))))))","v":"."},{"$f":"IF('soil moisture classes '!$C$16='GEST 2.0'!$P$2,'GEST 2.0'!U58,IF('soil moisture classes '!$C$16='GEST 2.0'!$V$2,'GEST 2.0'!AA58,IF('soil moisture classes '!$C$16='GEST 2.0'!$AB$2,'GEST 2.0'!AG58,IF('soil moisture classes '!$C$16='GEST 2.0'!$AH$2,'GEST 2.0'!AM58,IF('soil moisture classes '!$C$16='GEST 2.0'!$AN$2,'GEST 2.0'!AS58,IF('soil moisture classes '!$C$16='GEST 2.0'!$AT$2,'GEST 2.0'!AY58,\"\"))))))","v":"."}]
[" :","S2","Dry to moderately moist arable land on peaty soils(Anmoor)",null,null,null,null,null,null,null,null,null,null,12,null,{"$f":"IF('soil moisture classes '!$C$15='GEST 2.0'!$P$2,'GEST 2.0'!P59,IF('soil moisture classes '!$C$15='GEST 2.0'!$V$2,'GEST 2.0'!V59,IF('soil moisture classes '!$C$15='GEST 2.0'!$AB$2,'GEST 2.0'!AB59,IF('soil moisture classes '!$C$15='GEST 2.0'!$AH$2,'GEST 2.0'!AH59,IF('soil moisture classes '!$C$15='GEST 2.0'!$AN$2,'GEST 2.0'!AN59,IF('soil moisture classes '!$C$15='GEST 2.0'!$AT$2,'GEST 2.0'!AT59,\"\"))))))","v":"."},{"$f":"IF('soil moisture classes '!$C$15='GEST 2.0'!$P$2,'GEST 2.0'!Q59,IF('soil moisture classes '!$C$15='GEST 2.0'!$V$2,'GEST 2.0'!W59,IF('soil moisture classes '!$C$15='GEST 2.0'!$AB$2,'GEST 2.0'!AC59,IF('soil moisture classes '!$C$15='GEST 2.0'!$AH$2,'GEST 2.0'!AI59,IF('soil moisture classes '!$C$15='GEST 2.0'!$AN$2,'GEST 2.0'!AO59,IF('soil moisture classes '!$C$15='GEST 2.0'!$AT$2,'GEST 2.0'!AU59,\"\"))))))","v":"."},{"$f":"IF('soil moisture classes '!$C$15='GEST 2.0'!$P$2,'GEST 2.0'!R59,IF('soil moisture classes '!$C$15='GEST 2.0'!$V$2,'GEST 2.0'!X59,IF('soil moisture classes '!$C$15='GEST 2.0'!$AB$2,'GEST 2.0'!AD59,IF('soil moisture classes '!$C$15='GEST 2.0'!$AH$2,'GEST 2.0'!AJ59,IF('soil moisture classes '!$C$15='GEST 2.0'!$AN$2,'GEST 2.0'!AP59,IF('soil moisture classes '!$C$15='GEST 2.0'!$AT$2,'GEST 2.0'!AV59,\"\"))))))","v":"."},{"$f":"IF('soil moisture classes '!$C$15='GEST 2.0'!$P$2,'GEST 2.0'!S59,IF('soil moisture classes '!$C$15='GEST 2.0'!$V$2,'GEST 2.0'!Y59,IF('soil moisture classes '!$C$15='GEST 2.0'!$AB$2,'GEST 2.0'!AE59,IF('soil moisture classes '!$C$15='GEST 2.0'!$AH$2,'GEST 2.0'!AK59,IF('soil moisture classes '!$C$15='GEST 2.0'!$AN$2,'GEST 2.0'!AQ59,IF('soil moisture classes '!$C$15='GEST 2.0'!$AT$2,'GEST 2.0'!AW59,\"\"))))))","v":"."},{"$f":"IF('soil moisture classes '!$C$15='GEST 2.0'!$P$2,'GEST 2.0'!T59,IF('soil moisture classes '!$C$15='GEST 2.0'!$V$2,'GEST 2.0'!Z59,IF('soil moisture classes '!$C$15='GEST 2.0'!$AB$2,'GEST 2.0'!AF59,IF('soil moisture classes '!$C$15='GEST 2.0'!$AH$2,'GEST 2.0'!AL59,IF('soil moisture classes '!$C$15='GEST 2.0'!$AN$2,'GEST 2.0'!AR59,IF('soil moisture classes '!$C$15='GEST 2.0'!$AT$2,'GEST 2.0'!AX59,\"\"))))))","v":"."},{"$f":"IF('soil moisture classes '!$C$15='GEST 2.0'!$P$2,'GEST 2.0'!U59,IF('soil moisture classes '!$C$15='GEST 2.0'!$V$2,'GEST 2.0'!AA59,IF('soil moisture classes '!$C$15='GEST 2.0'!$AB$2,'GEST 2.0'!AG59,IF('soil moisture classes '!$C$15='GEST 2.0'!$AH$2,'GEST 2.0'!AM59,IF('soil moisture classes '!$C$15='GEST 2.0'!$AN$2,'GEST 2.0'!AS59,IF('soil moisture classes '!$C$15='GEST 2.0'!$AT$2,'GEST 2.0'!AY59,\"\"))))))","v":"."},{"$f":"IF('soil moisture classes '!$C$16='GEST 2.0'!$P$2,'GEST 2.0'!P59,IF('soil moisture classes '!$C$16='GEST 2.0'!$V$2,'GEST 2.0'!V59,IF('soil moisture classes '!$C$16='GEST 2.0'!$AB$2,'GEST 2.0'!AB59,IF('soil moisture classes '!$C$16='GEST 2.0'!$AH$2,'GEST 2.0'!AH59,IF('soil moisture classes '!$C$16='GEST 2.0'!$AN$2,'GEST 2.0'!AN59,IF('soil moisture classes '!$C$16='GEST 2.0'!$AT$2,'GEST 2.0'!AT59,\"\"))))))","v":"."},{"$f":"IF('soil moisture classes '!$C$16='GEST 2.0'!$P$2,'GEST 2.0'!Q59,IF('soil moisture classes '!$C$16='GEST 2.0'!$V$2,'GEST 2.0'!W59,IF('soil moisture classes '!$C$16='GEST 2.0'!$AB$2,'GEST 2.0'!AC59,IF('soil moisture classes '!$C$16='GEST 2.0'!$AH$2,'GEST 2.0'!AI59,IF('soil moisture classes '!$C$16='GEST 2.0'!$AN$2,'GEST 2.0'!AO59,IF('soil moisture classes '!$C$16='GEST 2.0'!$AT$2,'GEST 2.0'!AU59,\"\"))))))","v":"."},{"$f":"IF('soil moisture classes '!$C$16='GEST 2.0'!$P$2,'GEST 2.0'!R59,IF('soil moisture classes '!$C$16='GEST 2.0'!$V$2,'GEST 2.0'!X59,IF('soil moisture classes '!$C$16='GEST 2.0'!$AB$2,'GEST 2.0'!AD59,IF('soil moisture classes '!$C$16='GEST 2.0'!$AH$2,'GEST 2.0'!AJ59,IF('soil moisture classes '!$C$16='GEST 2.0'!$AN$2,'GEST 2.0'!AP59,IF('soil moisture classes '!$C$16='GEST 2.0'!$AT$2,'GEST 2.0'!AV59,\"\"))))))","v":"."},{"$f":"IF('soil moisture classes '!$C$16='GEST 2.0'!$P$2,'GEST 2.0'!S59,IF('soil moisture classes '!$C$16='GEST 2.0'!$V$2,'GEST 2.0'!Y59,IF('soil moisture classes '!$C$16='GEST 2.0'!$AB$2,'GEST 2.0'!AE59,IF('soil moisture classes '!$C$16='GEST 2.0'!$AH$2,'GEST 2.0'!AK59,IF('soil moisture classes '!$C$16='GEST 2.0'!$AN$2,'GEST 2.0'!AQ59,IF('soil moisture classes '!$C$16='GEST 2.0'!$AT$2,'GEST 2.0'!AW59,\"\"))))))","v":"."},{"$f":"IF('soil moisture classes '!$C$16='GEST 2.0'!$P$2,'GEST 2.0'!T59,IF('soil moisture classes '!$C$16='GEST 2.0'!$V$2,'GEST 2.0'!Z59,IF('soil moisture classes '!$C$16='GEST 2.0'!$AB$2,'GEST 2.0'!AF59,IF('soil moisture classes '!$C$16='GEST 2.0'!$AH$2,'GEST 2.0'!AL59,IF('soil moisture classes '!$C$16='GEST 2.0'!$AN$2,'GEST 2.0'!AR59,IF('soil moisture classes '!$C$16='GEST 2.0'!$AT$2,'GEST 2.0'!AX59,\"\"))))))","v":"."},{"$f":"IF('soil moisture classes '!$C$16='GEST 2.0'!$P$2,'GEST 2.0'!U59,IF('soil moisture classes '!$C$16='GEST 2.0'!$V$2,'GEST 2.0'!AA59,IF('soil moisture classes '!$C$16='GEST 2.0'!$AB$2,'GEST 2.0'!AG59,IF('soil moisture classes '!$C$16='GEST 2.0'!$AH$2,'GEST 2.0'!AM59,IF('soil moisture classes '!$C$16='GEST 2.0'!$AN$2,'GEST 2.0'!AS59,IF('soil moisture classes '!$C$16='GEST 2.0'!$AT$2,'GEST 2.0'!AY59,\"\"))))))","v":"."}]
[" :","S3","Cropland (2+) flooded in summer (wet year)",null,null,null,null,null,null,null,null,null,null,13,null,{"$f":"IF('soil moisture classes '!$C$15='GEST 2.0'!$P$2,'GEST 2.0'!P60,IF('soil moisture classes '!$C$15='GEST 2.0'!$V$2,'GEST 2.0'!V60,IF('soil moisture classes '!$C$15='GEST 2.0'!$AB$2,'GEST 2.0'!AB60,IF('soil moisture classes '!$C$15='GEST 2.0'!$AH$2,'GEST 2.0'!AH60,IF('soil moisture classes '!$C$15='GEST 2.0'!$AN$2,'GEST 2.0'!AN60,IF('soil moisture classes '!$C$15='GEST 2.0'!$AT$2,'GEST 2.0'!AT60,\"\"))))))","v":"."},{"$f":"IF('soil moisture classes '!$C$15='GEST 2.0'!$P$2,'GEST 2.0'!Q60,IF('soil moisture classes '!$C$15='GEST 2.0'!$V$2,'GEST 2.0'!W60,IF('soil moisture classes '!$C$15='GEST 2.0'!$AB$2,'GEST 2.0'!AC60,IF('soil moisture classes '!$C$15='GEST 2.0'!$AH$2,'GEST 2.0'!AI60,IF('soil moisture classes '!$C$15='GEST 2.0'!$AN$2,'GEST 2.0'!AO60,IF('soil moisture classes '!$C$15='GEST 2.0'!$AT$2,'GEST 2.0'!AU60,\"\"))))))","v":"."},{"$f":"IF('soil moisture classes '!$C$15='GEST 2.0'!$P$2,'GEST 2.0'!R60,IF('soil moisture classes '!$C$15='GEST 2.0'!$V$2,'GEST 2.0'!X60,IF('soil moisture classes '!$C$15='GEST 2.0'!$AB$2,'GEST 2.0'!AD60,IF('soil moisture classes '!$C$15='GEST 2.0'!$AH$2,'GEST 2.0'!AJ60,IF('soil moisture classes '!$C$15='GEST 2.0'!$AN$2,'GEST 2.0'!AP60,IF('soil moisture classes '!$C$15='GEST 2.0'!$AT$2,'GEST 2.0'!AV60,\"\"))))))","v":"."},{"$f":"IF('soil moisture classes '!$C$15='GEST 2.0'!$P$2,'GEST 2.0'!S60,IF('soil moisture classes '!$C$15='GEST 2.0'!$V$2,'GEST 2.0'!Y60,IF('soil moisture classes '!$C$15='GEST 2.0'!$AB$2,'GEST 2.0'!AE60,IF('soil moisture classes '!$C$15='GEST 2.0'!$AH$2,'GEST 2.0'!AK60,IF('soil moisture classes '!$C$15='GEST 2.0'!$AN$2,'GEST 2.0'!AQ60,IF('soil moisture classes '!$C$15='GEST 2.0'!$AT$2,'GEST 2.0'!AW60,\"\"))))))","v":"."},{"$f":"IF('soil moisture classes '!$C$15='GEST 2.0'!$P$2,'GEST 2.0'!T60,IF('soil moisture classes '!$C$15='GEST 2.0'!$V$2,'GEST 2.0'!Z60,IF('soil moisture classes '!$C$15='GEST 2.0'!$AB$2,'GEST 2.0'!AF60,IF('soil moisture classes '!$C$15='GEST 2.0'!$AH$2,'GEST 2.0'!AL60,IF('soil moisture classes '!$C$15='GEST 2.0'!$AN$2,'GEST 2.0'!AR60,IF('soil moisture classes '!$C$15='GEST 2.0'!$AT$2,'GEST 2.0'!AX60,\"\"))))))","v":"."},{"$f":"IF('soil moisture classes '!$C$15='GEST 2.0'!$P$2,'GEST 2.0'!U60,IF('soil moisture classes '!$C$15='GEST 2.0'!$V$2,'GEST 2.0'!AA60,IF('soil moisture classes '!$C$15='GEST 2.0'!$AB$2,'GEST 2.0'!AG60,IF('soil moisture classes '!$C$15='GEST 2.0'!$AH$2,'GEST 2.0'!AM60,IF('soil moisture classes '!$C$15='GEST 2.0'!$AN$2,'GEST 2.0'!AS60,IF('soil moisture classes '!$C$15='GEST 2.0'!$AT$2,'GEST 2.0'!AY60,\"\"))))))","v":"."},{"$f":"IF('soil moisture classes '!$C$16='GEST 2.0'!$P$2,'GEST 2.0'!P60,IF('soil moisture classes '!$C$16='GEST 2.0'!$V$2,'GEST 2.0'!V60,IF('soil moisture classes '!$C$16='GEST 2.0'!$AB$2,'GEST 2.0'!AB60,IF('soil moisture classes '!$C$16='GEST 2.0'!$AH$2,'GEST 2.0'!AH60,IF('soil moisture classes '!$C$16='GEST 2.0'!$AN$2,'GEST 2.0'!AN60,IF('soil moisture classes '!$C$16='GEST 2.0'!$AT$2,'GEST 2.0'!AT60,\"\"))))))","v":"."},{"$f":"IF('soil moisture classes '!$C$16='GEST 2.0'!$P$2,'GEST 2.0'!Q60,IF('soil moisture classes '!$C$16='GEST 2.0'!$V$2,'GEST 2.0'!W60,IF('soil moisture classes '!$C$16='GEST 2.0'!$AB$2,'GEST 2.0'!AC60,IF('soil moisture classes '!$C$16='GEST 2.0'!$AH$2,'GEST 2.0'!AI60,IF('soil moisture classes '!$C$16='GEST 2.0'!$AN$2,'GEST 2.0'!AO60,IF('soil moisture classes '!$C$16='GEST 2.0'!$AT$2,'GEST 2.0'!AU60,\"\"))))))","v":"."},{"$f":"IF('soil moisture classes '!$C$16='GEST 2.0'!$P$2,'GEST 2.0'!R60,IF('soil moisture classes '!$C$16='GEST 2.0'!$V$2,'GEST 2.0'!X60,IF('soil moisture classes '!$C$16='GEST 2.0'!$AB$2,'GEST 2.0'!AD60,IF('soil moisture classes '!$C$16='GEST 2.0'!$AH$2,'GEST 2.0'!AJ60,IF('soil moisture classes '!$C$16='GEST 2.0'!$AN$2,'GEST 2.0'!AP60,IF('soil moisture classes '!$C$16='GEST 2.0'!$AT$2,'GEST 2.0'!AV60,\"\"))))))","v":"."},{"$f":"IF('soil moisture classes '!$C$16='GEST 2.0'!$P$2,'GEST 2.0'!S60,IF('soil moisture classes '!$C$16='GEST 2.0'!$V$2,'GEST 2.0'!Y60,IF('soil moisture classes '!$C$16='GEST 2.0'!$AB$2,'GEST 2.0'!AE60,IF('soil moisture classes '!$C$16='GEST 2.0'!$AH$2,'GEST 2.0'!AK60,IF('soil moisture classes '!$C$16='GEST 2.0'!$AN$2,'GEST 2.0'!AQ60,IF('soil moisture classes '!$C$16='GEST 2.0'!$AT$2,'GEST 2.0'!AW60,\"\"))))))","v":"."},{"$f":"IF('soil moisture classes '!$C$16='GEST 2.0'!$P$2,'GEST 2.0'!T60,IF('soil moisture classes '!$C$16='GEST 2.0'!$V$2,'GEST 2.0'!Z60,IF('soil moisture classes '!$C$16='GEST 2.0'!$AB$2,'GEST 2.0'!AF60,IF('soil moisture classes '!$C$16='GEST 2.0'!$AH$2,'GEST 2.0'!AL60,IF('soil moisture classes '!$C$16='GEST 2.0'!$AN$2,'GEST 2.0'!AR60,IF('soil moisture classes '!$C$16='GEST 2.0'!$AT$2,'GEST 2.0'!AX60,\"\"))))))","v":"."},{"$f":"IF('soil moisture classes '!$C$16='GEST 2.0'!$P$2,'GEST 2.0'!U60,IF('soil moisture classes '!$C$16='GEST 2.0'!$V$2,'GEST 2.0'!AA60,IF('soil moisture classes '!$C$16='GEST 2.0'!$AB$2,'GEST 2.0'!AG60,IF('soil moisture classes '!$C$16='GEST 2.0'!$AH$2,'GEST 2.0'!AM60,IF('soil moisture classes '!$C$16='GEST 2.0'!$AN$2,'GEST 2.0'!AS60,IF('soil moisture classes '!$C$16='GEST 2.0'!$AT$2,'GEST 2.0'!AY60,\"\"))))))","v":"."}]
[" :","S4","Grassland (2+/3+) flooded in summer (wet year) ",null,null,null,null,null,null,null,null,null,null,14,null,{"$f":"IF('soil moisture classes '!$C$15='GEST 2.0'!$P$2,'GEST 2.0'!P61,IF('soil moisture classes '!$C$15='GEST 2.0'!$V$2,'GEST 2.0'!V61,IF('soil moisture classes '!$C$15='GEST 2.0'!$AB$2,'GEST 2.0'!AB61,IF('soil moisture classes '!$C$15='GEST 2.0'!$AH$2,'GEST 2.0'!AH61,IF('soil moisture classes '!$C$15='GEST 2.0'!$AN$2,'GEST 2.0'!AN61,IF('soil moisture classes '!$C$15='GEST 2.0'!$AT$2,'GEST 2.0'!AT61,\"\"))))))","v":"."},{"$f":"IF('soil moisture classes '!$C$15='GEST 2.0'!$P$2,'GEST 2.0'!Q61,IF('soil moisture classes '!$C$15='GEST 2.0'!$V$2,'GEST 2.0'!W61,IF('soil moisture classes '!$C$15='GEST 2.0'!$AB$2,'GEST 2.0'!AC61,IF('soil moisture classes '!$C$15='GEST 2.0'!$AH$2,'GEST 2.0'!AI61,IF('soil moisture classes '!$C$15='GEST 2.0'!$AN$2,'GEST 2.0'!AO61,IF('soil moisture classes '!$C$15='GEST 2.0'!$AT$2,'GEST 2.0'!AU61,\"\"))))))","v":"."},{"$f":"IF('soil moisture classes '!$C$15='GEST 2.0'!$P$2,'GEST 2.0'!R61,IF('soil moisture classes '!$C$15='GEST 2.0'!$V$2,'GEST 2.0'!X61,IF('soil moisture classes '!$C$15='GEST 2.0'!$AB$2,'GEST 2.0'!AD61,IF('soil moisture classes '!$C$15='GEST 2.0'!$AH$2,'GEST 2.0'!AJ61,IF('soil moisture classes '!$C$15='GEST 2.0'!$AN$2,'GEST 2.0'!AP61,IF('soil moisture classes '!$C$15='GEST 2.0'!$AT$2,'GEST 2.0'!AV61,\"\"))))))","v":"."},{"$f":"IF('soil moisture classes '!$C$15='GEST 2.0'!$P$2,'GEST 2.0'!S61,IF('soil moisture classes '!$C$15='GEST 2.0'!$V$2,'GEST 2.0'!Y61,IF('soil moisture classes '!$C$15='GEST 2.0'!$AB$2,'GEST 2.0'!AE61,IF('soil moisture classes '!$C$15='GEST 2.0'!$AH$2,'GEST 2.0'!AK61,IF('soil moisture classes '!$C$15='GEST 2.0'!$AN$2,'GEST 2.0'!AQ61,IF('soil moisture classes '!$C$15='GEST 2.0'!$AT$2,'GEST 2.0'!AW61,\"\"))))))","v":"."},{"$f":"IF('soil moisture classes '!$C$15='GEST 2.0'!$P$2,'GEST 2.0'!T61,IF('soil moisture classes '!$C$15='GEST 2.0'!$V$2,'GEST 2.0'!Z61,IF('soil moisture classes '!$C$15='GEST 2.0'!$AB$2,'GEST 2.0'!AF61,IF('soil moisture classes '!$C$15='GEST 2.0'!$AH$2,'GEST 2.0'!AL61,IF('soil moisture classes '!$C$15='GEST 2.0'!$AN$2,'GEST 2.0'!AR61,IF('soil moisture classes '!$C$15='GEST 2.0'!$AT$2,'GEST 2.0'!AX61,\"\"))))))","v":"."},{"$f":"IF('soil moisture classes '!$C$15='GEST 2.0'!$P$2,'GEST 2.0'!U61,IF('soil moisture classes '!$C$15='GEST 2.0'!$V$2,'GEST 2.0'!AA61,IF('soil moisture classes '!$C$15='GEST 2.0'!$AB$2,'GEST 2.0'!AG61,IF('soil moisture classes '!$C$15='GEST 2.0'!$AH$2,'GEST 2.0'!AM61,IF('soil moisture classes '!$C$15='GEST 2.0'!$AN$2,'GEST 2.0'!AS61,IF('soil moisture classes '!$C$15='GEST 2.0'!$AT$2,'GEST 2.0'!AY61,\"\"))))))","v":"."},{"$f":"IF('soil moisture classes '!$C$16='GEST 2.0'!$P$2,'GEST 2.0'!P61,IF('soil moisture classes '!$C$16='GEST 2.0'!$V$2,'GEST 2.0'!V61,IF('soil moisture classes '!$C$16='GEST 2.0'!$AB$2,'GEST 2.0'!AB61,IF('soil moisture classes '!$C$16='GEST 2.0'!$AH$2,'GEST 2.0'!AH61,IF('soil moisture classes '!$C$16='GEST 2.0'!$AN$2,'GEST 2.0'!AN61,IF('soil moisture classes '!$C$16='GEST 2.0'!$AT$2,'GEST 2.0'!AT61,\"\"))))))","v":"."},{"$f":"IF('soil moisture classes '!$C$16='GEST 2.0'!$P$2,'GEST 2.0'!Q61,IF('soil moisture classes '!$C$16='GEST 2.0'!$V$2,'GEST 2.0'!W61,IF('soil moisture classes '!$C$16='GEST 2.0'!$AB$2,'GEST 2.0'!AC61,IF('soil moisture classes '!$C$16='GEST 2.0'!$AH$2,'GEST 2.0'!AI61,IF('soil moisture classes '!$C$16='GEST 2.0'!$AN$2,'GEST 2.0'!AO61,IF('soil moisture classes '!$C$16='GEST 2.0'!$AT$2,'GEST 2.0'!AU61,\"\"))))))","v":"."},{"$f":"IF('soil moisture classes '!$C$16='GEST 2.0'!$P$2,'GEST 2.0'!R61,IF('soil moisture classes '!$C$16='GEST 2.0'!$V$2,'GEST 2.0'!X61,IF('soil moisture classes '!$C$16='GEST 2.0'!$AB$2,'GEST 2.0'!AD61,IF('soil moisture classes '!$C$16='GEST 2.0'!$AH$2,'GEST 2.0'!AJ61,IF('soil moisture classes '!$C$16='GEST 2.0'!$AN$2,'GEST 2.0'!AP61,IF('soil moisture classes '!$C$16='GEST 2.0'!$AT$2,'GEST 2.0'!AV61,\"\"))))))","v":"."},{"$f":"IF('soil moisture classes '!$C$16='GEST 2.0'!$P$2,'GEST 2.0'!S61,IF('soil moisture classes '!$C$16='GEST 2.0'!$V$2,'GEST 2.0'!Y61,IF('soil moisture classes '!$C$16='GEST 2.0'!$AB$2,'GEST 2.0'!AE61,IF('soil moisture classes '!$C$16='GEST 2.0'!$AH$2,'GEST 2.0'!AK61,IF('soil moisture classes '!$C$16='GEST 2.0'!$AN$2,'GEST 2.0'!AQ61,IF('soil moisture classes '!$C$16='GEST 2.0'!$AT$2,'GEST 2.0'!AW61,\"\"))))))","v":"."},{"$f":"IF('soil moisture classes '!$C$16='GEST 2.0'!$P$2,'GEST 2.0'!T61,IF('soil moisture classes '!$C$16='GEST 2.0'!$V$2,'GEST 2.0'!Z61,IF('soil moisture classes '!$C$16='GEST 2.0'!$AB$2,'GEST 2.0'!AF61,IF('soil moisture classes '!$C$16='GEST 2.0'!$AH$2,'GEST 2.0'!AL61,IF('soil moisture classes '!$C$16='GEST 2.0'!$AN$2,'GEST 2.0'!AR61,IF('soil moisture classes '!$C$16='GEST 2.0'!$AT$2,'GEST 2.0'!AX61,\"\"))))))","v":"."},{"$f":"IF('soil moisture classes '!$C$16='GEST 2.0'!$P$2,'GEST 2.0'!U61,IF('soil moisture classes '!$C$16='GEST 2.0'!$V$2,'GEST 2.0'!AA61,IF('soil moisture classes '!$C$16='GEST 2.0'!$AB$2,'GEST 2.0'!AG61,IF('soil moisture classes '!$C$16='GEST 2.0'!$AH$2,'GEST 2.0'!AM61,IF('soil moisture classes '!$C$16='GEST 2.0'!$AN$2,'GEST 2.0'!AS61,IF('soil moisture classes '!$C$16='GEST 2.0'!$AT$2,'GEST 2.0'!AY61,\"\"))))))","v":"."}]
[" :","S5","Simulated harvest (Paludiculture)",null,null,null,null,null,null,null,null,null,null,15,null,{"$f":"IF('soil moisture classes '!$C$15='GEST 2.0'!$P$2,'GEST 2.0'!P62,IF('soil moisture classes '!$C$15='GEST 2.0'!$V$2,'GEST 2.0'!V62,IF('soil moisture classes '!$C$15='GEST 2.0'!$AB$2,'GEST 2.0'!AB62,IF('soil moisture classes '!$C$15='GEST 2.0'!$AH$2,'GEST 2.0'!AH62,IF('soil moisture classes '!$C$15='GEST 2.0'!$AN$2,'GEST 2.0'!AN62,IF('soil moisture classes '!$C$15='GEST 2.0'!$AT$2,'GEST 2.0'!AT62,\"\"))))))","v":"."},{"$f":"IF('soil moisture classes '!$C$15='GEST 2.0'!$P$2,'GEST 2.0'!Q62,IF('soil moisture classes '!$C$15='GEST 2.0'!$V$2,'GEST 2.0'!W62,IF('soil moisture classes '!$C$15='GEST 2.0'!$AB$2,'GEST 2.0'!AC62,IF('soil moisture classes '!$C$15='GEST 2.0'!$AH$2,'GEST 2.0'!AI62,IF('soil moisture classes '!$C$15='GEST 2.0'!$AN$2,'GEST 2.0'!AO62,IF('soil moisture classes '!$C$15='GEST 2.0'!$AT$2,'GEST 2.0'!AU62,\"\"))))))","v":"."},{"$f":"IF('soil moisture classes '!$C$15='GEST 2.0'!$P$2,'GEST 2.0'!R62,IF('soil moisture classes '!$C$15='GEST 2.0'!$V$2,'GEST 2.0'!X62,IF('soil moisture classes '!$C$15='GEST 2.0'!$AB$2,'GEST 2.0'!AD62,IF('soil moisture classes '!$C$15='GEST 2.0'!$AH$2,'GEST 2.0'!AJ62,IF('soil moisture classes '!$C$15='GEST 2.0'!$AN$2,'GEST 2.0'!AP62,IF('soil moisture classes '!$C$15='GEST 2.0'!$AT$2,'GEST 2.0'!AV62,\"\"))))))","v":"."},{"$f":"IF('soil moisture classes '!$C$15='GEST 2.0'!$P$2,'GEST 2.0'!S62,IF('soil moisture classes '!$C$15='GEST 2.0'!$V$2,'GEST 2.0'!Y62,IF('soil moisture classes '!$C$15='GEST 2.0'!$AB$2,'GEST 2.0'!AE62,IF('soil moisture classes '!$C$15='GEST 2.0'!$AH$2,'GEST 2.0'!AK62,IF('soil moisture classes '!$C$15='GEST 2.0'!$AN$2,'GEST 2.0'!AQ62,IF('soil moisture classes '!$C$15='GEST 2.0'!$AT$2,'GEST 2.0'!AW62,\"\"))))))","v":"."},{"$f":"IF('soil moisture classes '!$C$15='GEST 2.0'!$P$2,'GEST 2.0'!T62,IF('soil moisture classes '!$C$15='GEST 2.0'!$V$2,'GEST 2.0'!Z62,IF('soil moisture classes '!$C$15='GEST 2.0'!$AB$2,'GEST 2.0'!AF62,IF('soil moisture classes '!$C$15='GEST 2.0'!$AH$2,'GEST 2.0'!AL62,IF('soil moisture classes '!$C$15='GEST 2.0'!$AN$2,'GEST 2.0'!AR62,IF('soil moisture classes '!$C$15='GEST 2.0'!$AT$2,'GEST 2.0'!AX62,\"\"))))))","v":"."},{"$f":"IF('soil moisture classes '!$C$15='GEST 2.0'!$P$2,'GEST 2.0'!U62,IF('soil moisture classes '!$C$15='GEST 2.0'!$V$2,'GEST 2.0'!AA62,IF('soil moisture classes '!$C$15='GEST 2.0'!$AB$2,'GEST 2.0'!AG62,IF('soil moisture classes '!$C$15='GEST 2.0'!$AH$2,'GEST 2.0'!AM62,IF('soil moisture classes '!$C$15='GEST 2.0'!$AN$2,'GEST 2.0'!AS62,IF('soil moisture classes '!$C$15='GEST 2.0'!$AT$2,'GEST 2.0'!AY62,\"\"))))))","v":"."},{"$f":"IF('soil moisture classes '!$C$16='GEST 2.0'!$P$2,'GEST 2.0'!P62,IF('soil moisture classes '!$C$16='GEST 2.0'!$V$2,'GEST 2.0'!V62,IF('soil moisture classes '!$C$16='GEST 2.0'!$AB$2,'GEST 2.0'!AB62,IF('soil moisture classes '!$C$16='GEST 2.0'!$AH$2,'GEST 2.0'!AH62,IF('soil moisture classes '!$C$16='GEST 2.0'!$AN$2,'GEST 2.0'!AN62,IF('soil moisture classes '!$C$16='GEST 2.0'!$AT$2,'GEST 2.0'!AT62,\"\"))))))","v":"."},{"$f":"IF('soil moisture classes '!$C$16='GEST 2.0'!$P$2,'GEST 2.0'!Q62,IF('soil moisture classes '!$C$16='GEST 2.0'!$V$2,'GEST 2.0'!W62,IF('soil moisture classes '!$C$16='GEST 2.0'!$AB$2,'GEST 2.0'!AC62,IF('soil moisture classes '!$C$16='GEST 2.0'!$AH$2,'GEST 2.0'!AI62,IF('soil moisture classes '!$C$16='GEST 2.0'!$AN$2,'GEST 2.0'!AO62,IF('soil moisture classes '!$C$16='GEST 2.0'!$AT$2,'GEST 2.0'!AU62,\"\"))))))","v":"."},{"$f":"IF('soil moisture classes '!$C$16='GEST 2.0'!$P$2,'GEST 2.0'!R62,IF('soil moisture classes '!$C$16='GEST 2.0'!$V$2,'GEST 2.0'!X62,IF('soil moisture classes '!$C$16='GEST 2.0'!$AB$2,'GEST 2.0'!AD62,IF('soil moisture classes '!$C$16='GEST 2.0'!$AH$2,'GEST 2.0'!AJ62,IF('soil moisture classes '!$C$16='GEST 2.0'!$AN$2,'GEST 2.0'!AP62,IF('soil moisture classes '!$C$16='GEST 2.0'!$AT$2,'GEST 2.0'!AV62,\"\"))))))","v":"."},{"$f":"IF('soil moisture classes '!$C$16='GEST 2.0'!$P$2,'GEST 2.0'!S62,IF('soil moisture classes '!$C$16='GEST 2.0'!$V$2,'GEST 2.0'!Y62,IF('soil moisture classes '!$C$16='GEST 2.0'!$AB$2,'GEST 2.0'!AE62,IF('soil moisture classes '!$C$16='GEST 2.0'!$AH$2,'GEST 2.0'!AK62,IF('soil moisture classes '!$C$16='GEST 2.0'!$AN$2,'GEST 2.0'!AQ62,IF('soil moisture classes '!$C$16='GEST 2.0'!$AT$2,'GEST 2.0'!AW62,\"\"))))))","v":"."},{"$f":"IF('soil moisture classes '!$C$16='GEST 2.0'!$P$2,'GEST 2.0'!T62,IF('soil moisture classes '!$C$16='GEST 2.0'!$V$2,'GEST 2.0'!Z62,IF('soil moisture classes '!$C$16='GEST 2.0'!$AB$2,'GEST 2.0'!AF62,IF('soil moisture classes '!$C$16='GEST 2.0'!$AH$2,'GEST 2.0'!AL62,IF('soil moisture classes '!$C$16='GEST 2.0'!$AN$2,'GEST 2.0'!AR62,IF('soil moisture classes '!$C$16='GEST 2.0'!$AT$2,'GEST 2.0'!AX62,\"\"))))))","v":"."},{"$f":"IF('soil moisture classes '!$C$16='GEST 2.0'!$P$2,'GEST 2.0'!U62,IF('soil moisture classes '!$C$16='GEST 2.0'!$V$2,'GEST 2.0'!AA62,IF('soil moisture classes '!$C$16='GEST 2.0'!$AB$2,'GEST 2.0'!AG62,IF('soil moisture classes '!$C$16='GEST 2.0'!$AH$2,'GEST 2.0'!AM62,IF('soil moisture classes '!$C$16='GEST 2.0'!$AN$2,'GEST 2.0'!AS62,IF('soil moisture classes '!$C$16='GEST 2.0'!$AT$2,'GEST 2.0'!AY62,\"\"))))))","v":"."}]
[" :","S6","Wet tall reeds (dry year)",null,null,null,null,null,null,null,null,null,null,16,null,{"$f":"IF('soil moisture classes '!$C$15='GEST 2.0'!$P$2,'GEST 2.0'!P63,IF('soil moisture classes '!$C$15='GEST 2.0'!$V$2,'GEST 2.0'!V63,IF('soil moisture classes '!$C$15='GEST 2.0'!$AB$2,'GEST 2.0'!AB63,IF('soil moisture classes '!$C$15='GEST 2.0'!$AH$2,'GEST 2.0'!AH63,IF('soil moisture classes '!$C$15='GEST 2.0'!$AN$2,'GEST 2.0'!AN63,IF('soil moisture classes '!$C$15='GEST 2.0'!$AT$2,'GEST 2.0'!AT63,\"\"))))))","v":"."},{"$f":"IF('soil moisture classes '!$C$15='GEST 2.0'!$P$2,'GEST 2.0'!Q63,IF('soil moisture classes '!$C$15='GEST 2.0'!$V$2,'GEST 2.0'!W63,IF('soil moisture classes '!$C$15='GEST 2.0'!$AB$2,'GEST 2.0'!AC63,IF('soil moisture classes '!$C$15='GEST 2.0'!$AH$2,'GEST 2.0'!AI63,IF('soil moisture classes '!$C$15='GEST 2.0'!$AN$2,'GEST 2.0'!AO63,IF('soil moisture classes '!$C$15='GEST 2.0'!$AT$2,'GEST 2.0'!AU63,\"\"))))))","v":"."},{"$f":"IF('soil moisture classes '!$C$15='GEST 2.0'!$P$2,'GEST 2.0'!R63,IF('soil moisture classes '!$C$15='GEST 2.0'!$V$2,'GEST 2.0'!X63,IF('soil moisture classes '!$C$15='GEST 2.0'!$AB$2,'GEST 2.0'!AD63,IF('soil moisture classes '!$C$15='GEST 2.0'!$AH$2,'GEST 2.0'!AJ63,IF('soil moisture classes '!$C$15='GEST 2.0'!$AN$2,'GEST 2.0'!AP63,IF('soil moisture classes '!$C$15='GEST 2.0'!$AT$2,'GEST 2.0'!AV63,\"\"))))))","v":"."},{"$f":"IF('soil moisture classes '!$C$15='GEST 2.0'!$P$2,'GEST 2.0'!S63,IF('soil moisture classes '!$C$15='GEST 2.0'!$V$2,'GEST 2.0'!Y63,IF('soil moisture classes '!$C$15='GEST 2.0'!$AB$2,'GEST 2.0'!AE63,IF('soil moisture classes '!$C$15='GEST 2.0'!$AH$2,'GEST 2.0'!AK63,IF('soil moisture classes '!$C$15='GEST 2.0'!$AN$2,'GEST 2.0'!AQ63,IF('soil moisture classes '!$C$15='GEST 2.0'!$AT$2,'GEST 2.0'!AW63,\"\"))))))","v":"."},{"$f":"IF('soil moisture classes '!$C$15='GEST 2.0'!$P$2,'GEST 2.0'!T63,IF('soil moisture classes '!$C$15='GEST 2.0'!$V$2,'GEST 2.0'!Z63,IF('soil moisture classes '!$C$15='GEST 2.0'!$AB$2,'GEST 2.0'!AF63,IF('soil moisture classes '!$C$15='GEST 2.0'!$AH$2,'GEST 2.0'!AL63,IF('soil moisture classes '!$C$15='GEST 2.0'!$AN$2,'GEST 2.0'!AR63,IF('soil moisture classes '!$C$15='GEST 2.0'!$AT$2,'GEST 2.0'!AX63,\"\"))))))","v":"."},{"$f":"IF('soil moisture classes '!$C$15='GEST 2.0'!$P$2,'GEST 2.0'!U63,IF('soil moisture classes '!$C$15='GEST 2.0'!$V$2,'GEST 2.0'!AA63,IF('soil moisture classes '!$C$15='GEST 2.0'!$AB$2,'GEST 2.0'!AG63,IF('soil moisture classes '!$C$15='GEST 2.0'!$AH$2,'GEST 2.0'!AM63,IF('soil moisture classes '!$C$15='GEST 2.0'!$AN$2,'GEST 2.0'!AS63,IF('soil moisture classes '!$C$15='GEST 2.0'!$AT$2,'GEST 2.0'!AY63,\"\"))))))","v":"."},{"$f":"IF('soil moisture classes '!$C$16='GEST 2.0'!$P$2,'GEST 2.0'!P63,IF('soil moisture classes '!$C$16='GEST 2.0'!$V$2,'GEST 2.0'!V63,IF('soil moisture classes '!$C$16='GEST 2.0'!$AB$2,'GEST 2.0'!AB63,IF('soil moisture classes '!$C$16='GEST 2.0'!$AH$2,'GEST 2.0'!AH63,IF('soil moisture classes '!$C$16='GEST 2.0'!$AN$2,'GEST 2.0'!AN63,IF('soil moisture classes '!$C$16='GEST 2.0'!$AT$2,'GEST 2.0'!AT63,\"\"))))))","v":"."},{"$f":"IF('soil moisture classes '!$C$16='GEST 2.0'!$P$2,'GEST 2.0'!Q63,IF('soil moisture classes '!$C$16='GEST 2.0'!$V$2,'GEST 2.0'!W63,IF('soil moisture classes '!$C$16='GEST 2.0'!$AB$2,'GEST 2.0'!AC63,IF('soil moisture classes '!$C$16='GEST 2.0'!$AH$2,'GEST 2.0'!AI63,IF('soil moisture classes '!$C$16='GEST 2.0'!$AN$2,'GEST 2.0'!AO63,IF('soil moisture classes '!$C$16='GEST 2.0'!$AT$2,'GEST 2.0'!AU63,\"\"))))))","v":"."},{"$f":"IF('soil moisture classes '!$C$16='GEST 2.0'!$P$2,'GEST 2.0'!R63,IF('soil moisture classes '!$C$16='GEST 2.0'!$V$2,'GEST 2.0'!X63,IF('soil moisture classes '!$C$16='GEST 2.0'!$AB$2,'GEST 2.0'!AD63,IF('soil moisture classes '!$C$16='GEST 2.0'!$AH$2,'GEST 2.0'!AJ63,IF('soil moisture classes '!$C$16='GEST 2.0'!$AN$2,'GEST 2.0'!AP63,IF('soil moisture classes '!$C$16='GEST 2.0'!$AT$2,'GEST 2.0'!AV63,\"\"))))))","v":"."},{"$f":"IF('soil moisture classes '!$C$16='GEST 2.0'!$P$2,'GEST 2.0'!S63,IF('soil moisture classes '!$C$16='GEST 2.0'!$V$2,'GEST 2.0'!Y63,IF('soil moisture classes '!$C$16='GEST 2.0'!$AB$2,'GEST 2.0'!AE63,IF('soil moisture classes '!$C$16='GEST 2.0'!$AH$2,'GEST 2.0'!AK63,IF('soil moisture classes '!$C$16='GEST 2.0'!$AN$2,'GEST 2.0'!AQ63,IF('soil moisture classes '!$C$16='GEST 2.0'!$AT$2,'GEST 2.0'!AW63,\"\"))))))","v":"."},{"$f":"IF('soil moisture classes '!$C$16='GEST 2.0'!$P$2,'GEST 2.0'!T63,IF('soil moisture classes '!$C$16='GEST 2.0'!$V$2,'GEST 2.0'!Z63,IF('soil moisture classes '!$C$16='GEST 2.0'!$AB$2,'GEST 2.0'!AF63,IF('soil moisture classes '!$C$16='GEST 2.0'!$AH$2,'GEST 2.0'!AL63,IF('soil moisture classes '!$C$16='GEST 2.0'!$AN$2,'GEST 2.0'!AR63,IF('soil moisture classes '!$C$16='GEST 2.0'!$AT$2,'GEST 2.0'!AX63,\"\"))))))","v":"."},{"$f":"IF('soil moisture classes '!$C$16='GEST 2.0'!$P$2,'GEST 2.0'!U63,IF('soil moisture classes '!$C$16='GEST 2.0'!$V$2,'GEST 2.0'!AA63,IF('soil moisture classes '!$C$16='GEST 2.0'!$AB$2,'GEST 2.0'!AG63,IF('soil moisture classes '!$C$16='GEST 2.0'!$AH$2,'GEST 2.0'!AM63,IF('soil moisture classes '!$C$16='GEST 2.0'!$AN$2,'GEST 2.0'!AS63,IF('soil moisture classes '!$C$16='GEST 2.0'!$AT$2,'GEST 2.0'!AY63,\"\"))))))","v":"."}]
[" :","S7","Sphagnum lawn  at former peat cut areas",null,null,null,null,null,null,null,null,null,null,17,null,{"$f":"IF('soil moisture classes '!$C$15='GEST 2.0'!$P$2,'GEST 2.0'!P64,IF('soil moisture classes '!$C$15='GEST 2.0'!$V$2,'GEST 2.0'!V64,IF('soil moisture classes '!$C$15='GEST 2.0'!$AB$2,'GEST 2.0'!AB64,IF('soil moisture classes '!$C$15='GEST 2.0'!$AH$2,'GEST 2.0'!AH64,IF('soil moisture classes '!$C$15='GEST 2.0'!$AN$2,'GEST 2.0'!AN64,IF('soil moisture classes '!$C$15='GEST 2.0'!$AT$2,'GEST 2.0'!AT64,\"\"))))))","v":"."},{"$f":"IF('soil moisture classes '!$C$15='GEST 2.0'!$P$2,'GEST 2.0'!Q64,IF('soil moisture classes '!$C$15='GEST 2.0'!$V$2,'GEST 2.0'!W64,IF('soil moisture classes '!$C$15='GEST 2.0'!$AB$2,'GEST 2.0'!AC64,IF('soil moisture classes '!$C$15='GEST 2.0'!$AH$2,'GEST 2.0'!AI64,IF('soil moisture classes '!$C$15='GEST 2.0'!$AN$2,'GEST 2.0'!AO64,IF('soil moisture classes '!$C$15='GEST 2.0'!$AT$2,'GEST 2.0'!AU64,\"\"))))))","v":"."},{"$f":"IF('soil moisture classes '!$C$15='GEST 2.0'!$P$2,'GEST 2.0'!R64,IF('soil moisture classes '!$C$15='GEST 2.0'!$V$2,'GEST 2.0'!X64,IF('soil moisture classes '!$C$15='GEST 2.0'!$AB$2,'GEST 2.0'!AD64,IF('soil moisture classes '!$C$15='GEST 2.0'!$AH$2,'GEST 2.0'!AJ64,IF('soil moisture classes '!$C$15='GEST 2.0'!$AN$2,'GEST 2.0'!AP64,IF('soil moisture classes '!$C$15='GEST 2.0'!$AT$2,'GEST 2.0'!AV64,\"\"))))))","v":"."},{"$f":"IF('soil moisture classes '!$C$15='GEST 2.0'!$P$2,'GEST 2.0'!S64,IF('soil moisture classes '!$C$15='GEST 2.0'!$V$2,'GEST 2.0'!Y64,IF('soil moisture classes '!$C$15='GEST 2.0'!$AB$2,'GEST 2.0'!AE64,IF('soil moisture classes '!$C$15='GEST 2.0'!$AH$2,'GEST 2.0'!AK64,IF('soil moisture classes '!$C$15='GEST 2.0'!$AN$2,'GEST 2.0'!AQ64,IF('soil moisture classes '!$C$15='GEST 2.0'!$AT$2,'GEST 2.0'!AW64,\"\"))))))","v":"."},{"$f":"IF('soil moisture classes '!$C$15='GEST 2.0'!$P$2,'GEST 2.0'!T64,IF('soil moisture classes '!$C$15='GEST 2.0'!$V$2,'GEST 2.0'!Z64,IF('soil moisture classes '!$C$15='GEST 2.0'!$AB$2,'GEST 2.0'!AF64,IF('soil moisture classes '!$C$15='GEST 2.0'!$AH$2,'GEST 2.0'!AL64,IF('soil moisture classes '!$C$15='GEST 2.0'!$AN$2,'GEST 2.0'!AR64,IF('soil moisture classes '!$C$15='GEST 2.0'!$AT$2,'GEST 2.0'!AX64,\"\"))))))","v":"."},{"$f":"IF('soil moisture classes '!$C$15='GEST 2.0'!$P$2,'GEST 2.0'!U64,IF('soil moisture classes '!$C$15='GEST 2.0'!$V$2,'GEST 2.0'!AA64,IF('soil moisture classes '!$C$15='GEST 2.0'!$AB$2,'GEST 2.0'!AG64,IF('soil moisture classes '!$C$15='GEST 2.0'!$AH$2,'GEST 2.0'!AM64,IF('soil moisture classes '!$C$15='GEST 2.0'!$AN$2,'GEST 2.0'!AS64,IF('soil moisture classes '!$C$15='GEST 2.0'!$AT$2,'GEST 2.0'!AY64,\"\"))))))","v":"."},{"$f":"IF('soil moisture classes '!$C$16='GEST 2.0'!$P$2,'GEST 2.0'!P64,IF('soil moisture classes '!$C$16='GEST 2.0'!$V$2,'GEST 2.0'!V64,IF('soil moisture classes '!$C$16='GEST 2.0'!$AB$2,'GEST 2.0'!AB64,IF('soil moisture classes '!$C$16='GEST 2.0'!$AH$2,'GEST 2.0'!AH64,IF('soil moisture classes '!$C$16='GEST 2.0'!$AN$2,'GEST 2.0'!AN64,IF('soil moisture classes '!$C$16='GEST 2.0'!$AT$2,'GEST 2.0'!AT64,\"\"))))))","v":"."},{"$f":"IF('soil moisture classes '!$C$16='GEST 2.0'!$P$2,'GEST 2.0'!Q64,IF('soil moisture classes '!$C$16='GEST 2.0'!$V$2,'GEST 2.0'!W64,IF('soil moisture classes '!$C$16='GEST 2.0'!$AB$2,'GEST 2.0'!AC64,IF('soil moisture classes '!$C$16='GEST 2.0'!$AH$2,'GEST 2.0'!AI64,IF('soil moisture classes '!$C$16='GEST 2.0'!$AN$2,'GEST 2.0'!AO64,IF('soil moisture classes '!$C$16='GEST 2.0'!$AT$2,'GEST 2.0'!AU64,\"\"))))))","v":"."},{"$f":"IF('soil moisture classes '!$C$16='GEST 2.0'!$P$2,'GEST 2.0'!R64,IF('soil moisture classes '!$C$16='GEST 2.0'!$V$2,'GEST 2.0'!X64,IF('soil moisture classes '!$C$16='GEST 2.0'!$AB$2,'GEST 2.0'!AD64,IF('soil moisture classes '!$C$16='GEST 2.0'!$AH$2,'GEST 2.0'!AJ64,IF('soil moisture classes '!$C$16='GEST 2.0'!$AN$2,'GEST 2.0'!AP64,IF('soil moisture classes '!$C$16='GEST 2.0'!$AT$2,'GEST 2.0'!AV64,\"\"))))))","v":"."},{"$f":"IF('soil moisture classes '!$C$16='GEST 2.0'!$P$2,'GEST 2.0'!S64,IF('soil moisture classes '!$C$16='GEST 2.0'!$V$2,'GEST 2.0'!Y64,IF('soil moisture classes '!$C$16='GEST 2.0'!$AB$2,'GEST 2.0'!AE64,IF('soil moisture classes '!$C$16='GEST 2.0'!$AH$2,'GEST 2.0'!AK64,IF('soil moisture classes '!$C$16='GEST 2.0'!$AN$2,'GEST 2.0'!AQ64,IF('soil moisture classes '!$C$16='GEST 2.0'!$AT$2,'GEST 2.0'!AW64,\"\"))))))","v":"."},{"$f":"IF('soil moisture classes '!$C$16='GEST 2.0'!$P$2,'GEST 2.0'!T64,IF('soil moisture classes '!$C$16='GEST 2.0'!$V$2,'GEST 2.0'!Z64,IF('soil moisture classes '!$C$16='GEST 2.0'!$AB$2,'GEST 2.0'!AF64,IF('soil moisture classes '!$C$16='GEST 2.0'!$AH$2,'GEST 2.0'!AL64,IF('soil moisture classes '!$C$16='GEST 2.0'!$AN$2,'GEST 2.0'!AR64,IF('soil moisture classes '!$C$16='GEST 2.0'!$AT$2,'GEST 2.0'!AX64,\"\"))))))","v":"."},{"$f":"IF('soil moisture classes '!$C$16='GEST 2.0'!$P$2,'GEST 2.0'!U64,IF('soil moisture classes '!$C$16='GEST 2.0'!$V$2,'GEST 2.0'!AA64,IF('soil moisture classes '!$C$16='GEST 2.0'!$AB$2,'GEST 2.0'!AG64,IF('soil moisture classes '!$C$16='GEST 2.0'!$AH$2,'GEST 2.0'!AM64,IF('soil moisture classes '!$C$16='GEST 2.0'!$AN$2,'GEST 2.0'!AS64,IF('soil moisture classes '!$C$16='GEST 2.0'!$AT$2,'GEST 2.0'!AY64,\"\"))))))","v":"."}]
[" :","S8","Very wet reeds with lateral import of organic matter",null,null,null,null,null,null,null,null,null,null,18,null,{"$f":"IF('soil moisture classes '!$C$15='GEST 2.0'!$P$2,'GEST 2.0'!P65,IF('soil moisture classes '!$C$15='GEST 2.0'!$V$2,'GEST 2.0'!V65,IF('soil moisture classes '!$C$15='GEST 2.0'!$AB$2,'GEST 2.0'!AB65,IF('soil moisture classes '!$C$15='GEST 2.0'!$AH$2,'GEST 2.0'!AH65,IF('soil moisture classes '!$C$15='GEST 2.0'!$AN$2,'GEST 2.0'!AN65,IF('soil moisture classes '!$C$15='GEST 2.0'!$AT$2,'GEST 2.0'!AT65,\"\"))))))","v":"."},{"$f":"IF('soil moisture classes '!$C$15='GEST 2.0'!$P$2,'GEST 2.0'!Q65,IF('soil moisture classes '!$C$15='GEST 2.0'!$V$2,'GEST 2.0'!W65,IF('soil moisture classes '!$C$15='GEST 2.0'!$AB$2,'GEST 2.0'!AC65,IF('soil moisture classes '!$C$15='GEST 2.0'!$AH$2,'GEST 2.0'!AI65,IF('soil moisture classes '!$C$15='GEST 2.0'!$AN$2,'GEST 2.0'!AO65,IF('soil moisture classes '!$C$15='GEST 2.0'!$AT$2,'GEST 2.0'!AU65,\"\"))))))","v":"."},{"$f":"IF('soil moisture classes '!$C$15='GEST 2.0'!$P$2,'GEST 2.0'!R65,IF('soil moisture classes '!$C$15='GEST 2.0'!$V$2,'GEST 2.0'!X65,IF('soil moisture classes '!$C$15='GEST 2.0'!$AB$2,'GEST 2.0'!AD65,IF('soil moisture classes '!$C$15='GEST 2.0'!$AH$2,'GEST 2.0'!AJ65,IF('soil moisture classes '!$C$15='GEST 2.0'!$AN$2,'GEST 2.0'!AP65,IF('soil moisture classes '!$C$15='GEST 2.0'!$AT$2,'GEST 2.0'!AV65,\"\"))))))","v":"."},{"$f":"IF('soil moisture classes '!$C$15='GEST 2.0'!$P$2,'GEST 2.0'!S65,IF('soil moisture classes '!$C$15='GEST 2.0'!$V$2,'GEST 2.0'!Y65,IF('soil moisture classes '!$C$15='GEST 2.0'!$AB$2,'GEST 2.0'!AE65,IF('soil moisture classes '!$C$15='GEST 2.0'!$AH$2,'GEST 2.0'!AK65,IF('soil moisture classes '!$C$15='GEST 2.0'!$AN$2,'GEST 2.0'!AQ65,IF('soil moisture classes '!$C$15='GEST 2.0'!$AT$2,'GEST 2.0'!AW65,\"\"))))))","v":"."},{"$f":"IF('soil moisture classes '!$C$15='GEST 2.0'!$P$2,'GEST 2.0'!T65,IF('soil moisture classes '!$C$15='GEST 2.0'!$V$2,'GEST 2.0'!Z65,IF('soil moisture classes '!$C$15='GEST 2.0'!$AB$2,'GEST 2.0'!AF65,IF('soil moisture classes '!$C$15='GEST 2.0'!$AH$2,'GEST 2.0'!AL65,IF('soil moisture classes '!$C$15='GEST 2.0'!$AN$2,'GEST 2.0'!AR65,IF('soil moisture classes '!$C$15='GEST 2.0'!$AT$2,'GEST 2.0'!AX65,\"\"))))))","v":"."},{"$f":"IF('soil moisture classes '!$C$15='GEST 2.0'!$P$2,'GEST 2.0'!U65,IF('soil moisture classes '!$C$15='GEST 2.0'!$V$2,'GEST 2.0'!AA65,IF('soil moisture classes '!$C$15='GEST 2.0'!$AB$2,'GEST 2.0'!AG65,IF('soil moisture classes '!$C$15='GEST 2.0'!$AH$2,'GEST 2.0'!AM65,IF('soil moisture classes '!$C$15='GEST 2.0'!$AN$2,'GEST 2.0'!AS65,IF('soil moisture classes '!$C$15='GEST 2.0'!$AT$2,'GEST 2.0'!AY65,\"\"))))))","v":"."},{"$f":"IF('soil moisture classes '!$C$16='GEST 2.0'!$P$2,'GEST 2.0'!P65,IF('soil moisture classes '!$C$16='GEST 2.0'!$V$2,'GEST 2.0'!V65,IF('soil moisture classes '!$C$16='GEST 2.0'!$AB$2,'GEST 2.0'!AB65,IF('soil moisture classes '!$C$16='GEST 2.0'!$AH$2,'GEST 2.0'!AH65,IF('soil moisture classes '!$C$16='GEST 2.0'!$AN$2,'GEST 2.0'!AN65,IF('soil moisture classes '!$C$16='GEST 2.0'!$AT$2,'GEST 2.0'!AT65,\"\"))))))","v":"."},{"$f":"IF('soil moisture classes '!$C$16='GEST 2.0'!$P$2,'GEST 2.0'!Q65,IF('soil moisture classes '!$C$16='GEST 2.0'!$V$2,'GEST 2.0'!W65,IF('soil moisture classes '!$C$16='GEST 2.0'!$AB$2,'GEST 2.0'!AC65,IF('soil moisture classes '!$C$16='GEST 2.0'!$AH$2,'GEST 2.0'!AI65,IF('soil moisture classes '!$C$16='GEST 2.0'!$AN$2,'GEST 2.0'!AO65,IF('soil moisture classes '!$C$16='GEST 2.0'!$AT$2,'GEST 2.0'!AU65,\"\"))))))","v":"."},{"$f":"IF('soil moisture classes '!$C$16='GEST 2.0'!$P$2,'GEST 2.0'!R65,IF('soil moisture classes '!$C$16='GEST 2.0'!$V$2,'GEST 2.0'!X65,IF('soil moisture classes '!$C$16='GEST 2.0'!$AB$2,'GEST 2.0'!AD65,IF('soil moisture classes '!$C$16='GEST 2.0'!$AH$2,'GEST 2.0'!AJ65,IF('soil moisture classes '!$C$16='GEST 2.0'!$AN$2,'GEST 2.0'!AP65,IF('soil moisture classes '!$C$16='GEST 2.0'!$AT$2,'GEST 2.0'!AV65,\"\"))))))","v":"."},{"$f":"IF('soil moisture classes '!$C$16='GEST 2.0'!$P$2,'GEST 2.0'!S65,IF('soil moisture classes '!$C$16='GEST 2.0'!$V$2,'GEST 2.0'!Y65,IF('soil moisture classes '!$C$16='GEST 2.0'!$AB$2,'GEST 2.0'!AE65,IF('soil moisture classes '!$C$16='GEST 2.0'!$AH$2,'GEST 2.0'!AK65,IF('soil moisture classes '!$C$16='GEST 2.0'!$AN$2,'GEST 2.0'!AQ65,IF('soil moisture classes '!$C$16='GEST 2.0'!$AT$2,'GEST 2.0'!AW65,\"\"))))))","v":"."},{"$f":"IF('soil moisture classes '!$C$16='GEST 2.0'!$P$2,'GEST 2.0'!T65,IF('soil moisture classes '!$C$16='GEST 2.0'!$V$2,'GEST 2.0'!Z65,IF('soil moisture classes '!$C$16='GEST 2.0'!$AB$2,'GEST 2.0'!AF65,IF('soil moisture classes '!$C$16='GEST 2.0'!$AH$2,'GEST 2.0'!AL65,IF('soil moisture classes '!$C$16='GEST 2.0'!$AN$2,'GEST 2.0'!AR65,IF('soil moisture classes '!$C$16='GEST 2.0'!$AT$2,'GEST 2.0'!AX65,\"\"))))))","v":"."},{"$f":"IF('soil moisture classes '!$C$16='GEST 2.0'!$P$2,'GEST 2.0'!U65,IF('soil moisture classes '!$C$16='GEST 2.0'!$V$2,'GEST 2.0'!AA65,IF('soil moisture classes '!$C$16='GEST 2.0'!$AB$2,'GEST 2.0'!AG65,IF('soil moisture classes '!$C$16='GEST 2.0'!$AH$2,'GEST 2.0'!AM65,IF('soil moisture classes '!$C$16='GEST 2.0'!$AN$2,'GEST 2.0'!AS65,IF('soil moisture classes '!$C$16='GEST 2.0'!$AT$2,'GEST 2.0'!AY65,\"\"))))))","v":"."}]
[" :","S9","Ditches in low intensity grassland",null,null,null,null,null,null,null,null,null,null,19,null,{"$f":"IF('soil moisture classes '!$C$15='GEST 2.0'!$P$2,'GEST 2.0'!P66,IF('soil moisture classes '!$C$15='GEST 2.0'!$V$2,'GEST 2.0'!V66,IF('soil moisture classes '!$C$15='GEST 2.0'!$AB$2,'GEST 2.0'!AB66,IF('soil moisture classes '!$C$15='GEST 2.0'!$AH$2,'GEST 2.0'!AH66,IF('soil moisture classes '!$C$15='GEST 2.0'!$AN$2,'GEST 2.0'!AN66,IF('soil moisture classes '!$C$15='GEST 2.0'!$AT$2,'GEST 2.0'!AT66,\"\"))))))","v":"."},{"$f":"IF('soil moisture classes '!$C$15='GEST 2.0'!$P$2,'GEST 2.0'!Q66,IF('soil moisture classes '!$C$15='GEST 2.0'!$V$2,'GEST 2.0'!W66,IF('soil moisture classes '!$C$15='GEST 2.0'!$AB$2,'GEST 2.0'!AC66,IF('soil moisture classes '!$C$15='GEST 2.0'!$AH$2,'GEST 2.0'!AI66,IF('soil moisture classes '!$C$15='GEST 2.0'!$AN$2,'GEST 2.0'!AO66,IF('soil moisture classes '!$C$15='GEST 2.0'!$AT$2,'GEST 2.0'!AU66,\"\"))))))","v":"."},{"$f":"IF('soil moisture classes '!$C$15='GEST 2.0'!$P$2,'GEST 2.0'!R66,IF('soil moisture classes '!$C$15='GEST 2.0'!$V$2,'GEST 2.0'!X66,IF('soil moisture classes '!$C$15='GEST 2.0'!$AB$2,'GEST 2.0'!AD66,IF('soil moisture classes '!$C$15='GEST 2.0'!$AH$2,'GEST 2.0'!AJ66,IF('soil moisture classes '!$C$15='GEST 2.0'!$AN$2,'GEST 2.0'!AP66,IF('soil moisture classes '!$C$15='GEST 2.0'!$AT$2,'GEST 2.0'!AV66,\"\"))))))","v":"."},{"$f":"IF('soil moisture classes '!$C$15='GEST 2.0'!$P$2,'GEST 2.0'!S66,IF('soil moisture classes '!$C$15='GEST 2.0'!$V$2,'GEST 2.0'!Y66,IF('soil moisture classes '!$C$15='GEST 2.0'!$AB$2,'GEST 2.0'!AE66,IF('soil moisture classes '!$C$15='GEST 2.0'!$AH$2,'GEST 2.0'!AK66,IF('soil moisture classes '!$C$15='GEST 2.0'!$AN$2,'GEST 2.0'!AQ66,IF('soil moisture classes '!$C$15='GEST 2.0'!$AT$2,'GEST 2.0'!AW66,\"\"))))))","v":"."},{"$f":"IF('soil moisture classes '!$C$15='GEST 2.0'!$P$2,'GEST 2.0'!T66,IF('soil moisture classes '!$C$15='GEST 2.0'!$V$2,'GEST 2.0'!Z66,IF('soil moisture classes '!$C$15='GEST 2.0'!$AB$2,'GEST 2.0'!AF66,IF('soil moisture classes '!$C$15='GEST 2.0'!$AH$2,'GEST 2.0'!AL66,IF('soil moisture classes '!$C$15='GEST 2.0'!$AN$2,'GEST 2.0'!AR66,IF('soil moisture classes '!$C$15='GEST 2.0'!$AT$2,'GEST 2.0'!AX66,\"\"))))))","v":"."},{"$f":"IF('soil moisture classes '!$C$15='GEST 2.0'!$P$2,'GEST 2.0'!U66,IF('soil moisture classes '!$C$15='GEST 2.0'!$V$2,'GEST 2.0'!AA66,IF('soil moisture classes '!$C$15='GEST 2.0'!$AB$2,'GEST 2.0'!AG66,IF('soil moisture classes '!$C$15='GEST 2.0'!$AH$2,'GEST 2.0'!AM66,IF('soil moisture classes '!$C$15='GEST 2.0'!$AN$2,'GEST 2.0'!AS66,IF('soil moisture classes '!$C$15='GEST 2.0'!$AT$2,'GEST 2.0'!AY66,\"\"))))))","v":"."},{"$f":"IF('soil moisture classes '!$C$16='GEST 2.0'!$P$2,'GEST 2.0'!P66,IF('soil moisture classes '!$C$16='GEST 2.0'!$V$2,'GEST 2.0'!V66,IF('soil moisture classes '!$C$16='GEST 2.0'!$AB$2,'GEST 2.0'!AB66,IF('soil moisture classes '!$C$16='GEST 2.0'!$AH$2,'GEST 2.0'!AH66,IF('soil moisture classes '!$C$16='GEST 2.0'!$AN$2,'GEST 2.0'!AN66,IF('soil moisture classes '!$C$16='GEST 2.0'!$AT$2,'GEST 2.0'!AT66,\"\"))))))","v":"."},{"$f":"IF('soil moisture classes '!$C$16='GEST 2.0'!$P$2,'GEST 2.0'!Q66,IF('soil moisture classes '!$C$16='GEST 2.0'!$V$2,'GEST 2.0'!W66,IF('soil moisture classes '!$C$16='GEST 2.0'!$AB$2,'GEST 2.0'!AC66,IF('soil moisture classes '!$C$16='GEST 2.0'!$AH$2,'GEST 2.0'!AI66,IF('soil moisture classes '!$C$16='GEST 2.0'!$AN$2,'GEST 2.0'!AO66,IF('soil moisture classes '!$C$16='GEST 2.0'!$AT$2,'GEST 2.0'!AU66,\"\"))))))","v":"."},{"$f":"IF('soil moisture classes '!$C$16='GEST 2.0'!$P$2,'GEST 2.0'!R66,IF('soil moisture classes '!$C$16='GEST 2.0'!$V$2,'GEST 2.0'!X66,IF('soil moisture classes '!$C$16='GEST 2.0'!$AB$2,'GEST 2.0'!AD66,IF('soil moisture classes '!$C$16='GEST 2.0'!$AH$2,'GEST 2.0'!AJ66,IF('soil moisture classes '!$C$16='GEST 2.0'!$AN$2,'GEST 2.0'!AP66,IF('soil moisture classes '!$C$16='GEST 2.0'!$AT$2,'GEST 2.0'!AV66,\"\"))))))","v":"."},{"$f":"IF('soil moisture classes '!$C$16='GEST 2.0'!$P$2,'GEST 2.0'!S66,IF('soil moisture classes '!$C$16='GEST 2.0'!$V$2,'GEST 2.0'!Y66,IF('soil moisture classes '!$C$16='GEST 2.0'!$AB$2,'GEST 2.0'!AE66,IF('soil moisture classes '!$C$16='GEST 2.0'!$AH$2,'GEST 2.0'!AK66,IF('soil moisture classes '!$C$16='GEST 2.0'!$AN$2,'GEST 2.0'!AQ66,IF('soil moisture classes '!$C$16='GEST 2.0'!$AT$2,'GEST 2.0'!AW66,\"\"))))))","v":"."},{"$f":"IF('soil moisture classes '!$C$16='GEST 2.0'!$P$2,'GEST 2.0'!T66,IF('soil moisture classes '!$C$16='GEST 2.0'!$V$2,'GEST 2.0'!Z66,IF('soil moisture classes '!$C$16='GEST 2.0'!$AB$2,'GEST 2.0'!AF66,IF('soil moisture classes '!$C$16='GEST 2.0'!$AH$2,'GEST 2.0'!AL66,IF('soil moisture classes '!$C$16='GEST 2.0'!$AN$2,'GEST 2.0'!AR66,IF('soil moisture classes '!$C$16='GEST 2.0'!$AT$2,'GEST 2.0'!AX66,\"\"))))))","v":"."},{"$f":"IF('soil moisture classes '!$C$16='GEST 2.0'!$P$2,'GEST 2.0'!U66,IF('soil moisture classes '!$C$16='GEST 2.0'!$V$2,'GEST 2.0'!AA66,IF('soil moisture classes '!$C$16='GEST 2.0'!$AB$2,'GEST 2.0'!AG66,IF('soil moisture classes '!$C$16='GEST 2.0'!$AH$2,'GEST 2.0'!AM66,IF('soil moisture classes '!$C$16='GEST 2.0'!$AN$2,'GEST 2.0'!AS66,IF('soil moisture classes '!$C$16='GEST 2.0'!$AT$2,'GEST 2.0'!AY66,\"\"))))))","v":"."}]
[null,null,null,null,null,null,null,null,null,null,null,null,null,20,null,{"$f":"IF('soil moisture classes '!$C$15='GEST 2.0'!$P$2,'GEST 2.0'!P67,IF('soil moisture classes '!$C$15='GEST 2.0'!$V$2,'GEST 2.0'!V67,IF('soil moisture classes '!$C$15='GEST 2.0'!$AB$2,'GEST 2.0'!AB67,IF('soil moisture classes '!$C$15='GEST 2.0'!$AH$2,'GEST 2.0'!AH67,IF('soil moisture classes '!$C$15='GEST 2.0'!$AN$2,'GEST 2.0'!AN67,IF('soil moisture classes '!$C$15='GEST 2.0'!$AT$2,'GEST 2.0'!AT67,\"\"))))))","v":"."},{"$f":"IF('soil moisture classes '!$C$15='GEST 2.0'!$P$2,'GEST 2.0'!Q67,IF('soil moisture classes '!$C$15='GEST 2.0'!$V$2,'GEST 2.0'!W67,IF('soil moisture classes '!$C$15='GEST 2.0'!$AB$2,'GEST 2.0'!AC67,IF('soil moisture classes '!$C$15='GEST 2.0'!$AH$2,'GEST 2.0'!AI67,IF('soil moisture classes '!$C$15='GEST 2.0'!$AN$2,'GEST 2.0'!AO67,IF('soil moisture classes '!$C$15='GEST 2.0'!$AT$2,'GEST 2.0'!AU67,\"\"))))))","v":"."},{"$f":"IF('soil moisture classes '!$C$15='GEST 2.0'!$P$2,'GEST 2.0'!R67,IF('soil moisture classes '!$C$15='GEST 2.0'!$V$2,'GEST 2.0'!X67,IF('soil moisture classes '!$C$15='GEST 2.0'!$AB$2,'GEST 2.0'!AD67,IF('soil moisture classes '!$C$15='GEST 2.0'!$AH$2,'GEST 2.0'!AJ67,IF('soil moisture classes '!$C$15='GEST 2.0'!$AN$2,'GEST 2.0'!AP67,IF('soil moisture classes '!$C$15='GEST 2.0'!$AT$2,'GEST 2.0'!AV67,\"\"))))))","v":"."},{"$f":"IF('soil moisture classes '!$C$15='GEST 2.0'!$P$2,'GEST 2.0'!S67,IF('soil moisture classes '!$C$15='GEST 2.0'!$V$2,'GEST 2.0'!Y67,IF('soil moisture classes '!$C$15='GEST 2.0'!$AB$2,'GEST 2.0'!AE67,IF('soil moisture classes '!$C$15='GEST 2.0'!$AH$2,'GEST 2.0'!AK67,IF('soil moisture classes '!$C$15='GEST 2.0'!$AN$2,'GEST 2.0'!AQ67,IF('soil moisture classes '!$C$15='GEST 2.0'!$AT$2,'GEST 2.0'!AW67,\"\"))))))","v":"."},{"$f":"IF('soil moisture classes '!$C$15='GEST 2.0'!$P$2,'GEST 2.0'!T67,IF('soil moisture classes '!$C$15='GEST 2.0'!$V$2,'GEST 2.0'!Z67,IF('soil moisture classes '!$C$15='GEST 2.0'!$AB$2,'GEST 2.0'!AF67,IF('soil moisture classes '!$C$15='GEST 2.0'!$AH$2,'GEST 2.0'!AL67,IF('soil moisture classes '!$C$15='GEST 2.0'!$AN$2,'GEST 2.0'!AR67,IF('soil moisture classes '!$C$15='GEST 2.0'!$AT$2,'GEST 2.0'!AX67,\"\"))))))","v":"."},{"$f":"IF('soil moisture classes '!$C$15='GEST 2.0'!$P$2,'GEST 2.0'!U67,IF('soil moisture classes '!$C$15='GEST 2.0'!$V$2,'GEST 2.0'!AA67,IF('soil moisture classes '!$C$15='GEST 2.0'!$AB$2,'GEST 2.0'!AG67,IF('soil moisture classes '!$C$15='GEST 2.0'!$AH$2,'GEST 2.0'!AM67,IF('soil moisture classes '!$C$15='GEST 2.0'!$AN$2,'GEST 2.0'!AS67,IF('soil moisture classes '!$C$15='GEST 2.0'!$AT$2,'GEST 2.0'!AY67,\"\"))))))","v":"."},{"$f":"IF('soil moisture classes '!$C$16='GEST 2.0'!$P$2,'GEST 2.0'!P67,IF('soil moisture classes '!$C$16='GEST 2.0'!$V$2,'GEST 2.0'!V67,IF('soil moisture classes '!$C$16='GEST 2.0'!$AB$2,'GEST 2.0'!AB67,IF('soil moisture classes '!$C$16='GEST 2.0'!$AH$2,'GEST 2.0'!AH67,IF('soil moisture classes '!$C$16='GEST 2.0'!$AN$2,'GEST 2.0'!AN67,IF('soil moisture classes '!$C$16='GEST 2.0'!$AT$2,'GEST 2.0'!AT67,\"\"))))))","v":"."},{"$f":"IF('soil moisture classes '!$C$16='GEST 2.0'!$P$2,'GEST 2.0'!Q67,IF('soil moisture classes '!$C$16='GEST 2.0'!$V$2,'GEST 2.0'!W67,IF('soil moisture classes '!$C$16='GEST 2.0'!$AB$2,'GEST 2.0'!AC67,IF('soil moisture classes '!$C$16='GEST 2.0'!$AH$2,'GEST 2.0'!AI67,IF('soil moisture classes '!$C$16='GEST 2.0'!$AN$2,'GEST 2.0'!AO67,IF('soil moisture classes '!$C$16='GEST 2.0'!$AT$2,'GEST 2.0'!AU67,\"\"))))))","v":"."},{"$f":"IF('soil moisture classes '!$C$16='GEST 2.0'!$P$2,'GEST 2.0'!R67,IF('soil moisture classes '!$C$16='GEST 2.0'!$V$2,'GEST 2.0'!X67,IF('soil moisture classes '!$C$16='GEST 2.0'!$AB$2,'GEST 2.0'!AD67,IF('soil moisture classes '!$C$16='GEST 2.0'!$AH$2,'GEST 2.0'!AJ67,IF('soil moisture classes '!$C$16='GEST 2.0'!$AN$2,'GEST 2.0'!AP67,IF('soil moisture classes '!$C$16='GEST 2.0'!$AT$2,'GEST 2.0'!AV67,\"\"))))))","v":"."},{"$f":"IF('soil moisture classes '!$C$16='GEST 2.0'!$P$2,'GEST 2.0'!S67,IF('soil moisture classes '!$C$16='GEST 2.0'!$V$2,'GEST 2.0'!Y67,IF('soil moisture classes '!$C$16='GEST 2.0'!$AB$2,'GEST 2.0'!AE67,IF('soil moisture classes '!$C$16='GEST 2.0'!$AH$2,'GEST 2.0'!AK67,IF('soil moisture classes '!$C$16='GEST 2.0'!$AN$2,'GEST 2.0'!AQ67,IF('soil moisture classes '!$C$16='GEST 2.0'!$AT$2,'GEST 2.0'!AW67,\"\"))))))","v":"."},{"$f":"IF('soil moisture classes '!$C$16='GEST 2.0'!$P$2,'GEST 2.0'!T67,IF('soil moisture classes '!$C$16='GEST 2.0'!$V$2,'GEST 2.0'!Z67,IF('soil moisture classes '!$C$16='GEST 2.0'!$AB$2,'GEST 2.0'!AF67,IF('soil moisture classes '!$C$16='GEST 2.0'!$AH$2,'GEST 2.0'!AL67,IF('soil moisture classes '!$C$16='GEST 2.0'!$AN$2,'GEST 2.0'!AR67,IF('soil moisture classes '!$C$16='GEST 2.0'!$AT$2,'GEST 2.0'!AX67,\"\"))))))","v":"."},{"$f":"IF('soil moisture classes '!$C$16='GEST 2.0'!$P$2,'GEST 2.0'!U67,IF('soil moisture classes '!$C$16='GEST 2.0'!$V$2,'GEST 2.0'!AA67,IF('soil moisture classes '!$C$16='GEST 2.0'!$AB$2,'GEST 2.0'!AG67,IF('soil moisture classes '!$C$16='GEST 2.0'!$AH$2,'GEST 2.0'!AM67,IF('soil moisture classes '!$C$16='GEST 2.0'!$AN$2,'GEST 2.0'!AS67,IF('soil moisture classes '!$C$16='GEST 2.0'!$AT$2,'GEST 2.0'!AY67,\"\"))))))","v":"."}]
[null,null,null,null,null,null,null,null,null,null,null,null,null,21,null,{"$f":"IF('soil moisture classes '!$C$15='GEST 2.0'!$P$2,'GEST 2.0'!P68,IF('soil moisture classes '!$C$15='GEST 2.0'!$V$2,'GEST 2.0'!V68,IF('soil moisture classes '!$C$15='GEST 2.0'!$AB$2,'GEST 2.0'!AB68,IF('soil moisture classes '!$C$15='GEST 2.0'!$AH$2,'GEST 2.0'!AH68,IF('soil moisture classes '!$C$15='GEST 2.0'!$AN$2,'GEST 2.0'!AN68,IF('soil moisture classes '!$C$15='GEST 2.0'!$AT$2,'GEST 2.0'!AT68,\"\"))))))","v":"."},{"$f":"IF('soil moisture classes '!$C$15='GEST 2.0'!$P$2,'GEST 2.0'!Q68,IF('soil moisture classes '!$C$15='GEST 2.0'!$V$2,'GEST 2.0'!W68,IF('soil moisture classes '!$C$15='GEST 2.0'!$AB$2,'GEST 2.0'!AC68,IF('soil moisture classes '!$C$15='GEST 2.0'!$AH$2,'GEST 2.0'!AI68,IF('soil moisture classes '!$C$15='GEST 2.0'!$AN$2,'GEST 2.0'!AO68,IF('soil moisture classes '!$C$15='GEST 2.0'!$AT$2,'GEST 2.0'!AU68,\"\"))))))","v":"."},{"$f":"IF('soil moisture classes '!$C$15='GEST 2.0'!$P$2,'GEST 2.0'!R68,IF('soil moisture classes '!$C$15='GEST 2.0'!$V$2,'GEST 2.0'!X68,IF('soil moisture classes '!$C$15='GEST 2.0'!$AB$2,'GEST 2.0'!AD68,IF('soil moisture classes '!$C$15='GEST 2.0'!$AH$2,'GEST 2.0'!AJ68,IF('soil moisture classes '!$C$15='GEST 2.0'!$AN$2,'GEST 2.0'!AP68,IF('soil moisture classes '!$C$15='GEST 2.0'!$AT$2,'GEST 2.0'!AV68,\"\"))))))","v":"."},{"$f":"IF('soil moisture classes '!$C$15='GEST 2.0'!$P$2,'GEST 2.0'!S68,IF('soil moisture classes '!$C$15='GEST 2.0'!$V$2,'GEST 2.0'!Y68,IF('soil moisture classes '!$C$15='GEST 2.0'!$AB$2,'GEST 2.0'!AE68,IF('soil moisture classes '!$C$15='GEST 2.0'!$AH$2,'GEST 2.0'!AK68,IF('soil moisture classes '!$C$15='GEST 2.0'!$AN$2,'GEST 2.0'!AQ68,IF('soil moisture classes '!$C$15='GEST 2.0'!$AT$2,'GEST 2.0'!AW68,\"\"))))))","v":"."},{"$f":"IF('soil moisture classes '!$C$15='GEST 2.0'!$P$2,'GEST 2.0'!T68,IF('soil moisture classes '!$C$15='GEST 2.0'!$V$2,'GEST 2.0'!Z68,IF('soil moisture classes '!$C$15='GEST 2.0'!$AB$2,'GEST 2.0'!AF68,IF('soil moisture classes '!$C$15='GEST 2.0'!$AH$2,'GEST 2.0'!AL68,IF('soil moisture classes '!$C$15='GEST 2.0'!$AN$2,'GEST 2.0'!AR68,IF('soil moisture classes '!$C$15='GEST 2.0'!$AT$2,'GEST 2.0'!AX68,\"\"))))))","v":"."},{"$f":"IF('soil moisture classes '!$C$15='GEST 2.0'!$P$2,'GEST 2.0'!U68,IF('soil moisture classes '!$C$15='GEST 2.0'!$V$2,'GEST 2.0'!AA68,IF('soil moisture classes '!$C$15='GEST 2.0'!$AB$2,'GEST 2.0'!AG68,IF('soil moisture classes '!$C$15='GEST 2.0'!$AH$2,'GEST 2.0'!AM68,IF('soil moisture classes '!$C$15='GEST 2.0'!$AN$2,'GEST 2.0'!AS68,IF('soil moisture classes '!$C$15='GEST 2.0'!$AT$2,'GEST 2.0'!AY68,\"\"))))))","v":"."},{"$f":"IF('soil moisture classes '!$C$16='GEST 2.0'!$P$2,'GEST 2.0'!P68,IF('soil moisture classes '!$C$16='GEST 2.0'!$V$2,'GEST 2.0'!V68,IF('soil moisture classes '!$C$16='GEST 2.0'!$AB$2,'GEST 2.0'!AB68,IF('soil moisture classes '!$C$16='GEST 2.0'!$AH$2,'GEST 2.0'!AH68,IF('soil moisture classes '!$C$16='GEST 2.0'!$AN$2,'GEST 2.0'!AN68,IF('soil moisture classes '!$C$16='GEST 2.0'!$AT$2,'GEST 2.0'!AT68,\"\"))))))","v":"."},{"$f":"IF('soil moisture classes '!$C$16='GEST 2.0'!$P$2,'GEST 2.0'!Q68,IF('soil moisture classes '!$C$16='GEST 2.0'!$V$2,'GEST 2.0'!W68,IF('soil moisture classes '!$C$16='GEST 2.0'!$AB$2,'GEST 2.0'!AC68,IF('soil moisture classes '!$C$16='GEST 2.0'!$AH$2,'GEST 2.0'!AI68,IF('soil moisture classes '!$C$16='GEST 2.0'!$AN$2,'GEST 2.0'!AO68,IF('soil moisture classes '!$C$16='GEST 2.0'!$AT$2,'GEST 2.0'!AU68,\"\"))))))","v":"."},{"$f":"IF('soil moisture classes '!$C$16='GEST 2.0'!$P$2,'GEST 2.0'!R68,IF('soil moisture classes '!$C$16='GEST 2.0'!$V$2,'GEST 2.0'!X68,IF('soil moisture classes '!$C$16='GEST 2.0'!$AB$2,'GEST 2.0'!AD68,IF('soil moisture classes '!$C$16='GEST 2.0'!$AH$2,'GEST 2.0'!AJ68,IF('soil moisture classes '!$C$16='GEST 2.0'!$AN$2,'GEST 2.0'!AP68,IF('soil moisture classes '!$C$16='GEST 2.0'!$AT$2,'GEST 2.0'!AV68,\"\"))))))","v":"."},{"$f":"IF('soil moisture classes '!$C$16='GEST 2.0'!$P$2,'GEST 2.0'!S68,IF('soil moisture classes '!$C$16='GEST 2.0'!$V$2,'GEST 2.0'!Y68,IF('soil moisture classes '!$C$16='GEST 2.0'!$AB$2,'GEST 2.0'!AE68,IF('soil moisture classes '!$C$16='GEST 2.0'!$AH$2,'GEST 2.0'!AK68,IF('soil moisture classes '!$C$16='GEST 2.0'!$AN$2,'GEST 2.0'!AQ68,IF('soil moisture classes '!$C$16='GEST 2.0'!$AT$2,'GEST 2.0'!AW68,\"\"))))))","v":"."},{"$f":"IF('soil moisture classes '!$C$16='GEST 2.0'!$P$2,'GEST 2.0'!T68,IF('soil moisture classes '!$C$16='GEST 2.0'!$V$2,'GEST 2.0'!Z68,IF('soil moisture classes '!$C$16='GEST 2.0'!$AB$2,'GEST 2.0'!AF68,IF('soil moisture classes '!$C$16='GEST 2.0'!$AH$2,'GEST 2.0'!AL68,IF('soil moisture classes '!$C$16='GEST 2.0'!$AN$2,'GEST 2.0'!AR68,IF('soil moisture classes '!$C$16='GEST 2.0'!$AT$2,'GEST 2.0'!AX68,\"\"))))))","v":"."},{"$f":"IF('soil moisture classes '!$C$16='GEST 2.0'!$P$2,'GEST 2.0'!U68,IF('soil moisture classes '!$C$16='GEST 2.0'!$V$2,'GEST 2.0'!AA68,IF('soil moisture classes '!$C$16='GEST 2.0'!$AB$2,'GEST 2.0'!AG68,IF('soil moisture classes '!$C$16='GEST 2.0'!$AH$2,'GEST 2.0'!AM68,IF('soil moisture classes '!$C$16='GEST 2.0'!$AN$2,'GEST 2.0'!AS68,IF('soil moisture classes '!$C$16='GEST 2.0'!$AT$2,'GEST 2.0'!AY68,\"\"))))))","v":"."}]

{"sheet":"N2O Fertilizer cattle cropresid","index":8,"n_rows":236,"n_cols":18,"rows_kept":236,"cut":false,"hidden":true,"merged":[[50,10,50,11],[43,14,43,15],[43,16,43,17],[44,14,44,15],[44,10,44,11],[45,10,45,11],[46,10,46,11],[47,10,47,11],[48,10,48,11],[49,10,49,11]]}
[]
[]
[]
[]
[]
[]
[]
[]
[]
[]
[]
[]
[]
[]
[]
[]
[]
[null,null,"here F refers to total amounts of N applied to the soil or released in the soil N via:"]
[null,null,"synthetic fertilizer (SN; kg N year-1 );"]
[null,null,"organic additions (ON; kg N year-1 );"]
[null,null,"mineralization of soil organic matter as a result of changes in land use or management (SOM; kg N year-1 );"]
[null,null,"management and drainage of organic soils (OS, CG, TEMP; ha);"]
[null,null,"urine and dung of grazing cattle (PRP, CPP; kg N year-1);"]
[null,null,". "]
[null,null,"For soils in temperate climates without crop residues the emission factors (EF) are set at: "]
[null,null,"EF1 = 0.01 kg N–N2O kg N-1;"]
[null,null,"EF2CG,TEMP = 8 kg N–N2O ha-1 year-1;"]
[null,null,"EF3PRP,CPP = 0.02 kg N– N2O kg N-1 (IPCC 2006);"]
[]
[]
[null,null,"Tier 2) to estimate the direct emission of N2O from managed organic soils. For the Netherlands this is 4.7 kg N ha-1 year-1 + 1% of the N application via faecal deposition (dung) and ammonium fertilizers and 2% of all other N inputs (Protocol 8132 Direct emissions from agriculture, van der Hoek et al. 2007). "]
[]
[]
[]
[null,"dierlijke mest"]
[null,"N2O bemesting emissiearm",null,"kg N-N2O per kg N"]
[null,null,null,"gras",null,"bouw"]
[null,null,"grondwatertrap","emissiearm","oppervlakkig","emissiearm","oppervlakkig"]
[null,"veen","I",5.0000000000000001E-3,2.5000000000000001E-3,0.01,5.0000000000000001E-3]
[null,null,"II-III",0.01,5.0000000000000001E-3,0.02,0.01]
[null,null,"IV-VII*",5.0000000000000001E-3,2.5000000000000001E-3,0.01,5.0000000000000001E-3]
[]
[null,"kunstmest"]
[null,"N2O kunstmest",null,"BBPR Miterra",null,null,null,null,null,"Grondwaterstand",null,null,"GEST",null,"Soil moisture class (GEST)",null,"Water tables in relation to surface (+ above, - below)"]
[null,"N-kunstmest","grondwatertrap","nitraatmeststof (KAS)","ammoniummeststof",null,null,null,null,1,"grondwatertrap I; GHG nvt  GLG <50",null,"3+",null,null,null,"WLw","WLd"]
[null,"veen","I",0.02,0.01,null,null,null,null,2,"grondwatertrap II; GHG nvt  GLG 50-80",null,"2+",null,"7+","Upper sublitoral","+250 to +140 cm","+250 to +140 cm"]
[null,null,"II-III",0.04,0.02,null,null,null,null,3,"grondwatertrap III; GHG < 40  GLG 80-120",null,"2-",null,"6+","Flooded (lower eulittoral)","+150 to +10 cm","+140 to +0 cm"]
[null,null,"IV-VII*",0.02,0.01,null,null,null,null,4,"grondwatertrap IV; GHG > 40  GLG 80-120",null,"3-",null,"5+","Wet (upper eulittoral)","+ 10 to – 5 cm","+0 to -10 cm"]
[null,null,null,null,null,null,null,null,null,5,"grondwatertrap V; GHG <40  GLG >120",null,"4-",null,"4+","Semi wet (very moist)","-5 -to -15 cm","-10 to -20 cm"]
[null,null," Droge","Org.","Org.","Totale","Totale N ","Minerale",null,6,"grondwatertrap VI; GHG 40-80  GLG >120",null,"5-",null,"3+","moist","-15 to -35 cm","-20 to -45 cm"]
[null,"Mestsoort","stof","stof","C","P2O5",null,"N",null,7,"grondwatertrap VII; GHG >80  GLG >120",null,"5-",null,"2+","Moderate moist","-35 to -70 cm","-45 to -85 cm"]
[null,"Runderdrijfmest ",88,66," 38.4"," 1.4"," 5.1"," 2.9",null,null,"Uitkomst",null,null,null,"2-","Moderate dry","< 60 l / m2"]
[null,"Kalverdrijfmest",21,9," 5.2 ","1.4 ","2.7"," 1.8",null,null,null,null,null,null,"3-","Dry","60 – 100 l / m2"]
[null,"Runderstalmest ",210,160,"93.0 ","2.9 ","8.3"," 2.4",null,null,null,null,null,null,"4-","Very dry","100 – 140 l / m2"]
[null,"Varkensdrijfmest",80,53,"30.8 ","3.9"," 8.1 ","4.8",null,null,null,null,null,null,"5-","Extremely dry",">140 l / m2"]
[null,"Varkensdrijfmest(brijvoeding) ",93,63,36.6,4.3,9.9,5.6]
[null,"Drijfmestbiggenopfok",65,43,25,3.5,5.9,3.2]
[null,"Zeugendrijfmest ",54,35,20.3,3.8,4.5999999999999996,2.4]
[null,"Varkensstalmest",255,195,113.4,7.5,11.1,3.3]
[null,"Kippendrijfmest ",135,85,49.4,6.9,10.8,6.4]
[null,"Slachtkuikenmest",610,500,290.7,17.5,35.4,5.5]
[null,"Leghennenmest",702,510,296.5,25.5,29.5,4.5999999999999996]
[]
[]
[null,"Emissiefactoren"]
[null,"% N-oxiden uit NH3",0.15]
[null,"% N dat als nitraat uitspoelt",0.3]
[]
[null,"Ammoniak emissies Kunstmest"]
[null,"kunstmest nitraat",1.4999999999999999E-2,"%"]
[null,"Kunstmest ammonium",0.1,"%"]
[]
[null,"Ammoniak emissies mest"]
[null,"gras injectie",1.15E-2,null,"CHECK MET NIR"]
[null,"akker injectie",0.10349999999999999]
[]
[null,"Leached N"]
[null,"Nitraat N20-N",2.5000000000000001E-2,"/kg N leached"]
[]
[null,"N-Oxiden N2O-N",0.01]
[]
[]
[null,null,"gewasrest","N-binding"]
[null,"Akkerbouwgewassen","kg N/ha","kg N/ha"]
[null,null,0,0,null,null,"Maize"]
[null,"pootaardappelen",26,null,null,null,"Grass"]
[null,"consumptieaardappelen",26]
[null,"zetmeelaardappelen",26]
[null,"wintergerst",19]
[null,"zomergerst",19]
[null,"wintertarwe",28]
[null,"zomertarwe",28]
[null,"triticale",24]
[null,"rogge",16]
[null,"haver",19]
[null,"corn cob mix",70]
[null,"korrelmais",70]
[null,"bruinebonen",74,164]
[null,"veldbonen",16,325]
[null,"groene erwten en schokkers",74,164]
[null,"kapucijners",74,164]
[null,"suikerbieten",174]
[null,"voederbieten",92]
[null,"boerenkool",78]
[null,"erwten",194,164]
[null,"knolselderij",78]
[null,"kroten",78]
[null,"koolraap",78]
[null,"schorseneren",78]
[null,"spinazie",62]
[null,"stambonen",61,75]
[null,"suikermaïs",40]
[null,"tuinbonen",13,164]
[null,"zaaiuien",4]
[null,"zilveruien",4]
[null,"poot en plantuien",4]
[null,"was en bospeen",99]
[null,"winterpeen",99]
[null,"witlofwortel",78]
[null,"overig gr",65.5]
[null,"graszaad",28]
[null,"bloemzaden",28]
[null,"groentezaden",28]
[null,"koolzaad",42]
[null,"lijnzaad",42]
[null,"karwijzaad",37]
[null,"blauwmaanzaad",20]
[null,"cichorei",40]
[null,"hennep",40]
[null,"vlas",23]
[]
[]
["Direct N2O emissions"]
[null,null,"Baseline",null,"Rewetting"]
[null,"Animal manure"]
[null,"Applied",{"$f":"Input!$G$57","v":0},"kg N /ha",{"$f":"Input!$G$80","v":0},"kg N "]
[null,"EF N2O-N",0.02,"%",0.02,"%"]
[null,"N2O-N",{"$f":"C137*C136","v":0},null,{"$f":"E137*E136","v":0}]
[null,"N2O ha",{"$f":"C138*44/28","v":0},"N2O/ha",{"$f":"E138*44/28","v":0},"N2O/ha"]
[null,"N2O site",{"$f":"C139*Input!$G$28","v":0},"N2O/ site",{"$f":"E139*Input!$G$28","v":0},"N2O/ site"]
[null,"CO2 site",{"$f":"C140*'CO2-equivalents'!$B$7","v":0},"kg CO2-eq",{"$f":"E140*'CO2-equivalents'!$B$7","v":0},"kg CO2-eq"]
[]
[null,"Organic fertilizer applied"]
[null,"Applied",{"$f":"Input!G59","v":0},"kg N /ha",{"$f":"Input!G82","v":0},"kg N "]
[null,"EF N2O-N",0.02,"%",0.02,"%"]
[null,"N2O-N",{"$f":"C145*C144","v":0},null,{"$f":"E145*E144","v":0}]
[null,"N2O ha",{"$f":"C146*44/28","v":0},"N2O/ha",{"$f":"E146*44/28","v":0},"N2O/ha"]
[null,"N2O site",{"$f":"C147*Input!$G$28","v":0},"N2O/ site",{"$f":"E147*Input!$G$28","v":0},"N2O/ site"]
[null,"CO2 site",{"$f":"C148*'CO2-equivalents'!$B$7","v":0},"kg CO2-eq",{"$f":"E148*'CO2-equivalents'!$B$7","v":0},"kg CO2-eq"]
[]
[]
[null,"Grazing animals"]
[null,"N-EXCRETION/ANIMal",{"$f":"'DATA '!H82","v":0},"kg/year",{"$f":"'DATA '!I82","v":0},"kg/year"]
[null,"average number of animals in field",{"$f":"Input!G67","v":0},"amount",{"$f":"Input!G91","v":0},"amount"]
[null,"average duration in days",{"$f":"Input!G69","v":0},"days",{"$f":"Input!G93","v":0},"days"]
[null,"amount of N",{"$f":"C153*C154*(C155/365)/Input!G28","v":{"$error":"#DIV/0!"}},"kg N /ha",{"$f":"E153*E154*(E155/365)/Input!G28","v":{"$error":"#DIV/0!"}},"kg N /ha"]
[null,"EF",{"$f":"'DATA '!E82","v":0},null,{"$f":"'DATA '!F82","v":0}]
[null,"N2O-N",{"$f":"C157*C156","v":{"$error":"#DIV/0!"}},null,{"$f":"E157*E156","v":{"$error":"#DIV/0!"}}]
[null,"N2O ha",{"$f":"C158*44/28","v":{"$error":"#DIV/0!"}},"N2O/ha",{"$f":"E158*44/28","v":{"$error":"#DIV/0!"}},"N2O/ha"]
[null,"N2O site",{"$f":"C159*Input!$G$28","v":{"$error":"#DIV/0!"}},"N2O/ site",{"$f":"E159*Input!$G$28","v":{"$error":"#DIV/0!"}},"N2O/ site"]
[null,"CO2 site",{"$f":"C160*'CO2-equivalents'!$B$7","v":{"$error":"#DIV/0!"}},"kg CO2-eq",{"$f":"E160*'CO2-equivalents'!$B$7","v":{"$error":"#DIV/0!"}},"kg CO2-eq"]
[]
[null,"Synthetic Fertilizer"]
[null,"amount applied",{"$f":"Input!G63","v":0},"kg N ",{"$f":"Input!G86","v":0},"kg N "]
[null,"EF",{"$f":"IF('DATA '!C91=1,'DATA '!D88,'DATA '!D89)","v":0.01},null,{"$f":"IF('DATA '!C92=1,'DATA '!D88,'DATA '!D89)","v":0.02}]
[null,"N2O-N",{"$f":"C165*C164","v":0},null,{"$f":"E165*E164","v":0}]
[null,"N2O ha",{"$f":"C166*44/28","v":0},"N2O/ha",{"$f":"E166*44/28","v":0},"N2O/ha"]
[null,"N2O site",{"$f":"C167*Input!$G$28","v":0},"N2O/ site",{"$f":"E167*Input!$G$28","v":0},"N2O/ site"]
[null,"CO2 site",{"$f":"C168*'CO2-equivalents'!$B$7","v":0},"kg CO2-eq",{"$f":"E168*'CO2-equivalents'!$B$7","v":0},"kg CO2-eq"]
[]
[null,"Crop residues"]
[null,"Type of crop ",{"$f":"'DATA '!C101","v":6},"name",{"$f":"'DATA '!C104","v":6},"name"]
[null,"residue left on field ",{"$f":"'DATA '!C99","v":2},"yes/no",{"$f":"'DATA '!C100","v":1},"yes/no"]
[null,"N gehalte",1.4999999999999999E-2,null,1.4999999999999999E-2]
[null,"cropresidue fraction of total yield",{"$f":"IF(C173=1,IF(C172=1,'crop residue paludi'!K5,IF(C172=2,'crop residue paludi'!K21,0)),0)","v":0},null,{"$f":"IF(E173=1,IF(E172=1,'crop residue paludi'!K5,IF(E172=2,'crop residue paludi'!K21,0)),0)","v":0}]
[null,"amount applied",{"$f":"C175*Input!G71*1000*C174","v":0},"kg N ",{"$f":"E175*Input!G95*1000*E174","v":0},"kg N "]
[null,"EF",0.02,null,0.02]
[null,"N2O-N",{"$f":"C177*C176","v":0},null,{"$f":"E177*E176","v":0}]
[null,"N2O ha",{"$f":"C178*44/28","v":0},"N2O/ha",{"$f":"E178*44/28","v":0},"N2O/ha"]
[null,"N2O site",{"$f":"C179*Input!$G$28","v":0},"N2O/ site",{"$f":"E179*Input!$G$28","v":0},"N2O/ site"]
[null,"CO2 site",{"$f":"C180*'CO2-equivalents'!$B$7","v":0},"kg CO2-eq",{"$f":"E180*'CO2-equivalents'!$B$7","v":0},"kg CO2-eq"]
[]
[null,"N2O Basis waarde managed soils"]
[null,"N2O ha",8,"N2O/ha",8,"N2O/ha"]
[null,"N2O site",{"$f":"C184*Input!$G$28","v":0},"N2O/ site",{"$f":"E184*Input!$G$28","v":0},"N2O/ site"]
[null,"CO2 site",{"$f":"C185*'CO2-equivalents'!$B$7","v":0},"kg CO2-eq",{"$f":"E185*'CO2-equivalents'!$B$7","v":0},"kg CO2-eq"]
[]
[null,null,"Baseline",null,"Rewetting"]
[null,"TOTAL direct  N2O emissions site",{"$f":"(C186+C181+C169+C161+C149+C141)/1000","v":{"$error":"#DIV/0!"}}," CO2-eq",{"$f":"(E186+E181+E169+E161+E149+E141)/1000","v":{"$error":"#DIV/0!"}},"CO2-eq"]
[]
["INDIRECT N2O emissions"]
[]
[null,null,"Baseline",null,"Rewetting"]
[null,"Ammonia"]
[null,"Applied animal",{"$f":"C156+C136","v":{"$error":"#DIV/0!"}},"kg N /ha",{"$f":"E156+E136","v":{"$error":"#DIV/0!"}},"kg N "]
[null,"EF Ammonia",{"$f":"C75","v":0.10349999999999999},null,{"$f":"C75","v":0.10349999999999999},"%","CHECK INBOUWEN VERSCHIL GRASLAND EN AKKER "]
[null,"Vervluchtging N",{"$f":"C195*C196","v":{"$error":"#DIV/0!"}},"kg N /ha",{"$f":"E195*E196","v":{"$error":"#DIV/0!"}},"kg N /ha"]
[null,"EF N2O-N",0.01,null,0.01]
[null,"N2O-N",{"$f":"C197*C198","v":{"$error":"#DIV/0!"}},null,{"$f":"E198*E197","v":{"$error":"#DIV/0!"}}]
[null,"N2O ha",{"$f":"C199*44/28","v":{"$error":"#DIV/0!"}},"N2O/ha",{"$f":"E199*44/28","v":{"$error":"#DIV/0!"}},"N2O/ha"]
[null,"N2O site",{"$f":"C200*Input!$G$28","v":{"$error":"#DIV/0!"}},"N2O/ site",{"$f":"E200*Input!$G$28","v":{"$error":"#DIV/0!"}},"N2O/ site"]
[null,"CO2 site",{"$f":"C201*'CO2-equivalents'!$B$7","v":{"$error":"#DIV/0!"}},"kg CO2-eq",{"$f":"E201*'CO2-equivalents'!$B$7","v":{"$error":"#DIV/0!"}},"kg CO2-eq"]
[]
[null,"Fertilizer applied",{"$f":"C164","v":0},"kg N /ha",{"$f":"E164","v":0},"kg N /ha"]
[null,"EF Ammonia",{"$f":"IF('DATA '!C91=1,'DATA '!F88,'DATA '!F89)","v":0.1},null,{"$f":"IF('DATA '!C92=1,'DATA '!F88,'DATA '!F89)","v":1.4999999999999999E-2}]
[null,"Vervluchtging N",{"$f":"C204*C205","v":0},null,{"$f":"E204*E205","v":0}]
[null,"EF N2O-N",{"$f":"C198","v":0.01},null,0.01]
[null,"N2O-N",{"$f":"C206*C207","v":0},null,{"$f":"E207*E206","v":0}]
[null,"N2O ha",{"$f":"C208*44/28","v":0},"N2O/ha",{"$f":"E208*44/28","v":0},"N2O/ha"]
[null,"N2O site",{"$f":"C209*Input!$G$28","v":0},"N2O/ site",{"$f":"E209*Input!$G$28","v":0},"N2O/ site"]
[null,"CO2 site",{"$f":"C210*'CO2-equivalents'!$B$7","v":0},"kg CO2-eq",{"$f":"E210*'CO2-equivalents'!$B$7","v":0},"kg CO2-eq"]
[]
[null,"N-oxide"]
[null,"N",{"$f":"C204+C195","v":{"$error":"#DIV/0!"}},null,{"$f":"E204+E195","v":{"$error":"#DIV/0!"}}]
[null,"EF N-oxide uit  Ammonia",{"$f":"C66","v":0.15},null,{"$f":"C66","v":0.15}]
[null,"Vervluchtging N",{"$f":"C214*C215","v":{"$error":"#DIV/0!"}},null,{"$f":"E214*E215","v":{"$error":"#DIV/0!"}}]
[null,"EF N2O-N",{"$f":"C80","v":0.01},null,{"$f":"C80","v":0.01}]
[null,"N2O-N",{"$f":"C216*C217","v":{"$error":"#DIV/0!"}},null,{"$f":"E217*E216","v":{"$error":"#DIV/0!"}}]
[null,"N2O ha",{"$f":"C218*44/28","v":{"$error":"#DIV/0!"}},"N2O/ha",{"$f":"E218*44/28","v":{"$error":"#DIV/0!"}},"N2O/ha"]
[null,"N2O site",{"$f":"C219*Input!$G$28","v":{"$error":"#DIV/0!"}},"N2O/ site",{"$f":"E219*Input!$G$28","v":{"$error":"#DIV/0!"}},"N2O/ site"]
[null,"CO2 site",{"$f":"C220*'CO2-equivalents'!$B$7","v":{"$error":"#DIV/0!"}},"kg CO2-eq",{"$f":"E220*'CO2-equivalents'!$B$7","v":{"$error":"#DIV/0!"}},"kg CO2-eq"]
[]
[null,"Nitrate"]
[null,"applied animal",{"$f":"C136+C144","v":0},null,{"$f":"E136+E144","v":0}]
[null,"applied fertilizer",{"$f":"C164","v":0},null,{"$f":"E164","v":0}]
[null,"applied remaining",{"$f":"C144+C175","v":0},null,{"$f":"E144+E176","v":0}]
[null,"EF nitrate leaching",{"$f":"C67","v":0.3},null,{"$f":"C67","v":0.3}]
[null,"Nitrate leached",{"$f":"SUM(C224:C226)*C227","v":0},null,{"$f":"SUM(E224:E226)*E227","v":0}]
[null,"EF N2O-N",{"$f":"C78","v":2.5000000000000001E-2},null,{"$f":"C78","v":2.5000000000000001E-2}]
[null,"N2O-N",{"$f":"C228*C229","v":0},null,{"$f":"E229*E228","v":0}]
[null,"N2O ha",{"$f":"C230*44/28","v":0},"N2O/ha",{"$f":"E230*44/28","v":0},"N2O/ha"]
[null,"N2O site",{"$f":"C231*Input!$G$28","v":0},"N2O/ site",{"$f":"E231*Input!$G$28","v":0},"N2O/ site"]
[null,"CO2 site",{"$f":"C232*'CO2-equivalents'!$B$7","v":0},"kg CO2-eq",{"$f":"E232*'CO2-equivalents'!$B$7","v":0},"kg CO2-eq"]
[]
[null,null,"Baseline",null,"Rewetting"]
[null,"TOTAL indirect  N2O emissions site",{"$f":"(C233+C221+C211+C202)/1000","v":{"$error":"#DIV/0!"}},"CO2-eq",{"$f":"(E233+E221+E211+E2002)/1000","v":{"$error":"#DIV/0!"}}," CO2-eq"]

{"sheet":"fossil energy","index":9,"n_rows":20,"n_cols":7,"rows_kept":20,"cut":false,"hidden":true,"merged":[]}
[]
[]
[]
[null,"diesel ",3.35,"kg CO2/liter"]
[null,"electricity",0.58099999999999996,"kg CO2/ kwh"]
[]
[]
[]
[null,null,null,"Baseline",null,"Rewetting"]
[null,null,"Diesel",{"$f":"Input!G104","v":0},"l",{"$f":"Input!G111","v":0},"l"]
[null,null,"CO2 site",{"$f":"D10*C4","v":0},"kg CO2-eq",{"$f":"F10*C4","v":0},"kg CO2-eq"]
[]
[]
[null,null,"Electricity",{"$f":"Input!G106","v":0},"kWh",{"$f":"Input!G113","v":0},"kWh"]
[null,null,"CO2 site",{"$f":"D14*C5","v":0},"kg CO2-eq",{"$f":"F14*C5","v":0},"kg CO2-eq"]
[]
[]
[null,null,null,"Baseline",null,"Rewetting"]
[null,null,"TOTAL fossil energy",{"$f":"D11+D15","v":0},"kg CO2-eq",{"$f":"F11+F15","v":0},"kg CO2-eq"]
[null,null,null,{"$f":"D19/1000","v":0}," tCO2-eq",{"$f":"F19/1000","v":0},"tCO2-eq"]

{"sheet":"crop use","index":10,"n_rows":22,"n_cols":7,"rows_kept":22,"cut":false,"hidden":true,"merged":[]}
[]
[null,"Product use ","lifetime longer than 10 year","replace fossil product",{"$f":"Input!G95","v":0}]
[1,"building material e.g. insulation, taching, timber","yes","no",{"$f":"IF(OR(C3=\"yes\",D3=\"yes\"),1,0)","v":1},{"$f":"$E$2*E3","v":0},{"$f":"IF('DATA '!$C$103='crop use'!A3,'crop use'!F3,0)","v":0}]
[2,"bedding material","no","no",{"$f":"IF(OR(C4=\"yes\",D4=\"yes\"),1,0)","v":0},{"$f":"$E$2*E4","v":0},{"$f":"IF('DATA '!$C$103='crop use'!A4,'crop use'!F4,0)","v":0}]
[3,"food application","no","no",0,0,{"$f":"IF('DATA '!$C$103='crop use'!A5,'crop use'!F5,0)","v":0}]
[4,"fodder/ feed application","no","no",0,0,{"$f":"IF('DATA '!$C$103='crop use'!A6,'crop use'!F6,0)","v":0}]
[5,"energie use: biogas, combustion, wood etc","no","yes",1,0,{"$f":"IF('DATA '!$C$103='crop use'!A7,'crop use'!F7,0)","v":0}]
[6,"paper","yes","no",1,0,{"$f":"IF('DATA '!$C$103='crop use'!A8,'crop use'!F8,0)","v":0}]
[7,"extraction of ingredients/buildingblocks: protein, fibres, cellulose","no","yes",1,0,{"$f":"IF('DATA '!$C$103='crop use'!A9,'crop use'!F9,0)","v":0}]
[8,"high quality substrate in  horticulture","no","yes",1,0,{"$f":"IF('DATA '!$C$103='crop use'!A10,'crop use'!F10,0)","v":0}]
[9,"other uses/ unknown","no","no",0,0,{"$f":"IF('DATA '!$C$103='crop use'!A11,'crop use'!F11,0)","v":0}]
[null,null,null,null,null,null,{"$f":"SUM(G3:G11)","v":0}]
[null,"Paludi crops","carbon content","carbon gewicht","ton co2"]
[1,"Cattail (Typha sp.)",0.47499999999999998,{"$f":"C14*$G$12","v":0},{"$f":"D14*$D$22","v":0},{"$f":"IF('DATA '!$C$104='crop use'!A14,'crop use'!E14,0)","v":0}]
[2,"Reed (Phragmites australis)",0.47499999999999998,{"$f":"C15*$G$12","v":0},{"$f":"D15*$D$22","v":0},{"$f":"IF('DATA '!$C$104='crop use'!A15,'crop use'!E15,0)","v":0}]
[3,"Peat moss (Sphagnum sp.)",0.47499999999999998,0,0,{"$f":"IF('DATA '!$C$104='crop use'!A16,'crop use'!E16,0)","v":0}]
[4,"Grasses like reed canary grass ",0.47499999999999998,0,0,{"$f":"IF('DATA '!$C$104='crop use'!A17,'crop use'!E17,0)","v":0}]
[5,"Alder (Alnus sp.)",0.47499999999999998,0,0,{"$f":"IF('DATA '!$C$104='crop use'!A18,'crop use'!E18,0)","v":0}]
[6,"Other",0.47499999999999998,0,0,{"$f":"IF('DATA '!$C$104='crop use'!A19,'crop use'!E19,0)","v":0}]
[null,null,null,null,null,{"$f":"SUM(F14:F19)*-1","v":0},"ton co2/ha"]
[null,null,null,null,null,{"$f":"F20*Input!G28","v":0},"ton co2/ site"]
[null,null,"omreken factor C:CO2",{"$f":"44/12","v":3.6666666666666665}]

{"sheet":"C content soil","index":11,"n_rows":13,"n_cols":8,"rows_kept":13,"cut":false,"hidden":true,"merged":[]}
[]
[1,"Select peat type","BD (g/cm3)","C content (%)","C content (kg C/m2/cm thickness"]
[2,"Sphagnum",7.5999999999999998E-2,46,{"$f":"(C3*(D3/100))*(100*100)/1000","v":0.34959999999999997},null,null,"From: Loisel et al. 2014 - A database and synthesis of northern peatland soil properties and Holocen carbon and nitrogen accumulation. The Holocene 1-15"]
[3,"Herbaceous",0.11799999999999999,50.5,{"$f":"(C4*(D4/100))*(100*100)/1000","v":0.59589999999999999}]
[4,"Woody",0.108,50.9,0.54971999999999999]
[5,"Brown moss",0.17699999999999999,47.9,0.84782999999999997]
[6,"Unknown",0.11799999999999999,46.8,0.55224000000000006]
[7,"Humified",0.192,47.4,0.91007999999999989]
[]
[]
[null,"User input",null,"User input"]
[null,"Peat Type","kg/C/ha/cm thickness","Peat thickness","C-stock (ton C/ha)","C-stock (tCO2-eq/ha)"]
[null,1,{"$f":"VLOOKUP(B13,A2:E8,5)","v":"C content (kg C/m2/cm thickness"},{"$f":"Input!G36","v":0},{"$f":"C13*D13*10000/1000","v":{"$error":"#VALUE!"}},{"$f":"ROUND(E13*(44/12),1)","v":{"$error":"#VALUE!"}}]

{"sheet":"CO2-equivalents","index":12,"n_rows":7,"n_cols":11,"rows_kept":7,"cut":false,"hidden":true,"merged":[[1,0,1,13]]}
["Source: Myhre et al. 2013 - Anthropogenic and natural radiative forcing. In: IPCC 2013 0 Climate Change 2013: the natural science basis (Ch. 8)."]
["GWP's are given with and without climate - carbon feedbacks for CH4 and N2O, even though Myhre et al. State that \"it is likely that including the climate–carbon feedback ... provides a better estimate...\" the convention is to use GWP's without climate-carbon feedbacks. "]
["numbers used in SET are for 100 yr (GWP100) and without climate - carbon feedbacks",null,null,null,null,null,null,null,null,null,"Table from Myhre et al."]
[null,"CO2-eq (kg CO2-eq / kg gas)"]
["CO2",1]
["CH4",28]
["N2O",265]

{"sheet":"mol masses","index":13,"n_rows":8,"n_cols":2,"rows_kept":8,"cut":false,"hidden":true,"merged":[]}
["Item","mol mass"]
["C",12.01]
["O",16]
["N",14.01]
["H",1.008]
["CO2",{"$f":"B2+2*B3","v":44.01}]
["CH4",{"$f":"B2+4*B5","v":16.042000000000002}]
["N2O",{"$f":"2*B4+B3","v":44.019999999999996}]

{"sheet":"Soil Management","index":14,"n_rows":122,"n_cols":23,"rows_kept":122,"cut":false,"hidden":true,"merged":[[28,18,28,19],[29,14,29,16],[43,2,43,3],[48,2,48,3],[85,1,85,5]]}
["Energie"]
[]
["Management"]
[]
["Bodembewerking"]
["Brandstofverbruik verschil per 5 cm werkdiepte",0.1]
["Brandstof verschil tussen 4 en 7 schaar",0.73333333333333295]
["Brandstof verbruik zonder ondergronders min",0.1]
["Brandstof verbruik zonder vorenpakker",0.05]
["Brandstofverbruik brede beitels tov smalle",0.1]
["Verschil rechte tand tov kromme tand ( liter )",1.3]
["Brandstofverbruik ganzevoet beitels tov brede",0.1]
["triltand tov vaste tand",0.05]
["Schijveneg werkdiepte",0.05]
["Löss woelen tov zand",0.1]
["Löss cultivateren tov zand",0.1]
["Löss schijveneg tov zand",0.05]
["Klei woelen tov löss",0.1]
["Klei cultivateren tov löss",0.1]
["Klei schijveneg tov löss",0.05]
["Brandstofverbruik verschil per 5 cm strip till",0.05]
["Brandstofverbruik verschil per grondsoort strip till",0.05]
["Verschil brandstofverbruik per 5 cem cultivator",0.1]
["Smal tov brede beitel",0.05,"meer"]
["Triltand smal tov triltand brede beitel",0.1]
["klei tov loss striptill",0.05]
[]
[]
[null,null,null,null,null,null,null,null,null,null,null,null,null,null,null,null,null,null,"diesel toeslag grondsoort"]
[null,null,null,null,"Werkdiepte",null,null,null,null,null,"werkdiepten",null,null,null,"diesel toeslag werkdiepte",null,null,null,"zand","los","klei","veen"]
[null,"Woelen","Kromme","Smalle","16-20","Schijveneg",null,null,1,"Cultivator schijf","5-10","11-15","16-20",null,1,1.05,1.1000000000000001,1,1,1.05,1.1000000000000001,1.05]
[null,null,"Rechte","Brede","21-25","Cultivator",null,null,2,"Cultivator vaste tand","5-10","11-15","16-20",null,1,1.3692307692307693,1.6,1,1,1.1000000000000001,1.2,1.1000000000000001]
[null,null,null,"Ganzenvoet","26-30","Rotorkopeg",null,null,3,"Cultivator veertand","5-10","11-15","16-20",null,1,1.3692307692307693,1.6,1,1,1.1000000000000001,1.2,1.1000000000000001]
[null,null,null,null,"31-35","Rotorkopeg+zaaimachine",null,null,4,"Stoppelcultivator","5-10","11-15","16-20",null,1,1.3692307692307693,1.6,1,1,1.1000000000000001,1.2,1.1000000000000001]
[null,null,null,null,null,"Geen",null,null,5,"Frontpakker"," "," "," ",null,1,1,1,1,1,1,1,1]
[null,"Cultivateren","Vaste","Smalle","5-10",null,null,null,6,"Grondfrees"," "," "," ",null,1,1,1,1,1,1.05,1.1000000000000001,1.05]
[null,null,"Triltand","Brede","11-15",null,null,null,7,"Hakenfrees"," "," "," ",null,1,1,1,1,1,1.05,1.1000000000000001,1.05]
[null,null,null,"Ganzenvoet","16-20",null,null,null,8,"Rotorkopeg","5-10","11-15","16-20",null,1,1.1000000000000001,1.2,1,1,1.05,1.1000000000000001,1.05]
[null,"Schijveneg",2,null,"5-10",null,null,null,9,"Schijveneg","5-10","11-15","16-20",null,1,1.05,1.1000000000000001,1,1,1.05,1.1000000000000001,1.05]
[null,null,4,null,"11-15",null,null,null,10,"Spitmachine","16-20","21-25","26-30",null,1,1.0846560846560853,1.16931216931217,1,1,1.1000000000000001,1.2,1.1000000000000001]
[null,null,null,null,"16-20",null,null,null,11,"Volveldsfrees"," "," "," "," ",1,1,1,1,1,1.05,1.1000000000000001,1.05]
[null,"Mulchzaai","Schijveneg","Schijfkoulters","5-10",null,null,null,12,"Voorzetwoeler","16-20","21-25","26-30","31-35",0.7,0.8,0.9,1,1,1.1000000000000001,1.2,1.1000000000000001]
[null,null,"Triltanden","Slangenaanvoer","11-15",null,null,null,13,"Vorenpakker enkel of dubbel"," "," "," "," ",1,1,1,1,1,1.05,1.1000000000000001,1.05]
[null,null,"Schijveneg+triltanden",null,"16-20",null,null,null,14,"Vorenpakker frontopbouw"," "," "," "," ",1,1,1,1,1,1.05,1.1000000000000001,1.05]
[null,"Strip_till",4,null,"5-10",null,null,null,15,"Wentelploeg","16-20","21-25","26-30",null,1,1,1,1,1,1.1000000000000001,1.2,1.1000000000000001]
[null,null,6,null,"11-15",null,null,null,16,"Woeler","16-20","21-25","26-30","31-35",0.7,0.8,0.9,1,1,1.1000000000000001,1.2,1.1000000000000001]
[null,null,8,null,"16-20",null,null,null,17,"Zaaibedcombinatie gedragen"," "," "," "," ",1,1,1,1,1,1.05,1.1000000000000001,1.05]
[null,"Directzaai","Tarwe",null,null,null,null,null,18,"Duwploeg","16-20","21-25","26-30"," ",1,1,1,1,1,1.1000000000000001,1.2,1.1000000000000001]
[null,null,"Groenbemester",null,null,null,null,null,19,"Rupsbanden"," "," "," "," ",1,1,1,1,1,1,1,1]
[null,null,"Maïs",null,null,null,null,null,20,"Techniek + vasterijpaden"," "," "," "," ",1,1,1,1,1,1,1,1]
[]
[null,null,null,null,null,null,null,null,null,1]
[null,null,null,null,null,null,null,null,3,{"$f":"IF(ISNA(VLOOKUP(J$52,$I$31:$N$50,$I51,FALSE)),\"\",VLOOKUP(J$52,$I$31:$N$50,$I53,FALSE))","v":"5-10"},10,1E-4,10]
[null,null,null,null,null,null,null,null,4,{"$f":"IF(ISNA(VLOOKUP(J$52,$I$31:$N$50,$I54,FALSE)),\"\",VLOOKUP(J$52,$I$31:$N$50,$I54,FALSE))","v":"11-15"},15,1E-4,15]
[null,"Ploeg","Ja","Ja","16-20",2,null,null,5,{"$f":"IF(ISNA(VLOOKUP(J$52,$I$31:$N$50,$I55,FALSE)),\"\",VLOOKUP(J$52,$I$31:$N$50,$I55,FALSE))","v":"16-20"},20,1E-4,20]
[null,null,"Nee","Nee","21-25",3,null,null,6,{"$f":"IF(ISNA(VLOOKUP(J$50,$I$29:$N$48,$I56,FALSE)),\"\",VLOOKUP(J$50,$I$29:$N$48,$I56,FALSE))","v":""},1E-4,1E-4,1E-4]
[null,null,null,null,"26-30",4,null,null,"Uitkomst",2,15,1E-4,15]
[null,null,null,null,null,5,null,null,null,{"$f":"6+J57","v":8}]
[null,null,null,null,null,6]
[null,null,null,null,null,7,null,null,"diesel (l/ha)",{"$f":"'grondbew techniek (1)'!J31*'grondbew techniek (1)'!T31*('grondbew techniek (1)'!U31/100)*'grondbew techniek (1)'!N31","v":20.549374999999998}]
[null,null,null,null,null,8,null,null,"toeslag% werkdiepte",{"$f":"IF(ISNA(VLOOKUP(J$52,#REF!,J58,FALSE)),\"\",VLOOKUP(J$52,$I$31:$U$50,J58,FALSE))","v":1.05}]
[null,"Spitmachine",null,null,"16-20",null,null,null,"toeslag% grondsoort",{"$f":"IF(ISNA(VLOOKUP(J$52,#REF!,$D$80,FALSE)),\"\",VLOOKUP(J$52,$I$31:$U$50,$D$80,FALSE))","v":1}]
[null,null,null,null,"21-25",null,null,null,"diesel totaal (l/ha)",{"$f":"J60*J61*J62","v":21.576843749999998}]
[null,null,null,null,"26-30"]
[]
[]
[]
[]
[]
[]
[]
[]
[]
[]
[null,1,"Zand",null,5]
[null,2,"Zeeklei"]
[null,3,"Rivierklei"]
[null,4,"Veen/ dalgrond"]
[null,5,"Loss",11]
[null,null,null,11]
[]
["Broeikasgas emissies"]
[]
["diesel",3.1349999999999998,"kg Co2/liter"]
[]
[null,"Trekker met oplegger (43%,0%) Diesel tonkm 80 g CO2"]
[]
[]
[null,null,"bron kwin 2012",null,null,null,"bron: Countus",null,null,null,"bron kwin 2012",null,null,null,"bron kwin 2012","bron kwin 2012","bron Agentschap NL 2013"]
[null,null,"prijs aanschaf","prijs aanschaf min","prijs aanschaf max","gem prijs aanschaf","vermogen","vermogen min","vermogen max","gem vermogen","taaktijden","taaktijd min","taaktijd max","gem taaktijd","gem. afschrijving","gem. onderhoud","MIA","Vamil",null,"brandstofverbruik","belasting van de motor"]
[null,null,"euro","euro","euro","euro","kW","kW","kW","kW","uur/ha","uur/ha","uur/ha","uur/ha","%","%",null,null,null,"l/ kW","%","gewicht (kg)","countus waarden"]
[1,"Cultivator schijf","2500-10000",2500,10000,6250,"70-150",70,150,110,"0,75-1",0.75,1,0.875,6,2.5,0,0,null,0.30499999999999999,70,1750,"1000 - 2500"]
[2,"Cultivator vaste tand","3750-20000",3750,20000,11875,"70-150",70,150,110,"0,75-1",0.75,1,0.875,6,3.5,0,0,null,0.30499999999999999,70,1125,"750 - 1500"]
[3,"Cultivator veertand","5130-35000",5130,35000,20065,"70-150",70,150,110,"0,75-1",0.75,1,0.875,6,2.5,0,0,null,0.30499999999999999,70,1125,"750 - 1500"]
[4,"Stoppelcultivator","4000-6000",4000,6000,5000,"70-125",70,125,97.5,"0,75-1",0.75,1,0.875,6,3,0,0,null,0.30499999999999999,70,1125,"750 - 1500"]
[5,"Frontpakker","3500-6000",3500,6000,4750,50,50,50,50,"0,75-1",0.75,1,0.875,7.5,2.5,0,0,null,0.30499999999999999,70,1125,"750 - 1500"]
[6,"Grondfrees","950-11000",950,11000,5975,"70-125",70,125,97.5,"1,5-2,5",1.5,2.5,2,9,3,0,0,null,0.30499999999999999,70,1500,"1000 - 2000"]
[7,"Hakenfrees","6000-16800",6000,16800,11400,"70-125",70,125,97.5,"1,5-2,5",1.5,2.5,2,9,3,0,0,null,0.30499999999999999,70,1500,"1000 - 2000"]
[8,"Rotorkopeg","8000-44000",8000,44000,26000,"70-150",70,150,110,"0,8-1,2",0.8,1.2,1,7.5,3.5,0,0,null,0.30499999999999999,70,1325,"750 - 2000"]
[9,"Schijveneg","4500-50000",4500,50000,27250,"70-150",70,150,110,"0,8-1,2",0.8,1.2,1,7.5,3.5,0,0,null,0.30499999999999999,70,1750,"1000 - 2500"]
[10,"Spitmachine","25000-42000",25000,42000,33500,"70-150",70,150,110,"1,5-2",1.5,2,1.75,9,3.5,0,0,null,0.30499999999999999,70,1750,"1001 - 2500"]
[11,"Volveldsfrees","14500-20000",14500,20000,17250,"70-125",70,125,97.5,"1,5-2,5",1.5,2.5,2,9,3.5,0,0,null,0.30499999999999999,70,1500,"1000 - 2000"]
[12,"Voorzetwoeler","5300-8000",5300,8000,6650,"70-125",70,125,97.5,"0,8-1,2",0.8,1.2,1,4.5,2,0,0,null,0.30499999999999999,70,750,"500 - 1000"]
[13,"Vorenpakker enkel of dubbel","2000-9800",2000,9800,5900,"40-70",40,70,55,0.5,0.5,0.5,0.5,7.5,1.5,0,0,"extra",0.30499999999999999,70,1125,"750 - 1500"]
[14,"Vorenpakker frontopbouw","3000-15000",3000,15000,9000,"40-70",40,70,55,0.5,0.5,0.5,0.5,7.5,1.5,0,0,"extra",0.30499999999999999,70,1125,"750 - 1500"]
[15,"Wentelploeg","20000-55000",20000,55000,37500,"70-150",70,150,110,"1,5-2",1.5,2,1.75,7.5,5,0,0,null,0.30499999999999999,70,2250,"1500 - 3000"]
[16,"Woeler","2000-14000",2000,14000,8000,"70-100",70,100,85,"0,8-1,2",0.8,1.2,1,4.5,2,0,0,null,0.30499999999999999,70,750,"500 - 1000"]
[17,"Zaaibedcombinatie gedragen","3500-25000",3500,25000,14250,"70-125",70,125,97.5,"0,5-1",0.5,1,0.75,6,2,0,0,null,0.30499999999999999,70,1250,"500 - 2000"]
[18,"Duwploeg","15000-20000",15000,20000,17500,"40-70",40,70,55,0.5,0.5,0.5,0.5,7.5,5,0,0,"extra",0.30499999999999999,70,1500,"1000 - 2000"]
[19,"Rupsbanden",null,null,null,null,null,null,null,null,null,null,null,null,"?","?",0,0,null,0.30499999999999999,70,500,"500"]
[20,"Techniek + vasterijpaden",null,null,null,null,null,null,null,null,null,null,null,null,"?","?",0,0,null,0.30499999999999999,70,0.1]
[]
[]
["Oogsten"]
[]
[]
[null,2,3,4,5,6,7,8,9,10,11,12,13,14,15,16,17,18,19,20,21,22]
["Rekenwaarde","Check"]
[1,{"$f":"IF(ISNA(VLOOKUP($A$32,$A$5:$U$24,B117,FALSE)),\"\",VLOOKUP($A$32,$A$2:$U$24,B117,FALSE))","v":""},{"$f":"IF(ISNA(VLOOKUP($A$32,$A$5:$U$24,C117,FALSE)),\"\",VLOOKUP($A$32,$A$2:$U$24,C117,FALSE))","v":""},{"$f":"IF(ISNA(VLOOKUP($A$32,$A$5:$U$24,D117,FALSE)),\"\",VLOOKUP($A$32,$A$2:$U$24,D117,FALSE))","v":""},"",{"$f":"IF(ISNUMBER(F121),F121,VLOOKUP($A$32,$A$2:$U$24,F117,FALSE))","v":{"$error":"#N/A"}},"","","",{"$f":"IF(ISNUMBER(J121),J121,VLOOKUP($A$32,$A$2:$U$24,J117,FALSE))","v":{"$error":"#N/A"}},"","","",{"$f":"IF(ISNUMBER(N121),N121,VLOOKUP($A$32,$A$2:$U$24,N117,FALSE))","v":{"$error":"#N/A"}},{"$f":"IF(ISNUMBER(O121),O121,VLOOKUP($A$32,$A$2:$U$24,O117,FALSE))","v":{"$error":"#N/A"}},{"$f":"IF(ISNUMBER(P121),P121,VLOOKUP($A$32,$A$2:$U$24,P117,FALSE))","v":{"$error":"#N/A"}},"","","",{"$f":"IF(ISNUMBER(T121),T121,VLOOKUP($A$32,$A$2:$U$24,T117,FALSE))","v":{"$error":"#N/A"}},{"$f":"IF(ISNUMBER(U121),U121,VLOOKUP($A$32,$A$2:$V$24,U117,FALSE))","v":{"$error":"#N/A"}},{"$f":"IF(ISNUMBER(V121),V121,VLOOKUP($A$32,$A$2:$V$24,V117,FALSE))","v":{"$error":"#N/A"}}]
["Handmatig aangepast"]
[null,null,null,null,null,"",null,null,null,"",null,null,null,"","","",null,null,null,"","",""]
["Overig"]

{"sheet":"grondbew techniek (1)","index":15,"n_rows":33,"n_cols":23,"rows_kept":33,"cut":false,"hidden":true,"merged":[]}
[null,"Nieuwe techniek 1","bron kwin 2012",null,null,null,"bron: Countus",null,null,null,"bron kwin 2012",null,null,null,"bron kwin 2012","bron kwin 2012","bron Agentschap NL 2013"]
[null,null,"prijs aanschaf","prijs aanschaf min","prijs aanschaf max","gem prijs aanschaf","vermogen","vermogen min","vermogen max","gem vermogen","taaktijden","taaktijd min","taaktijd max","gem taaktijd","gem. afschrijving","gem. onderhoud","MIA","Vamil",null,"brandstofverbruik","belasting van de motor"]
[null,null,"euro","euro","euro","euro","kW","kW","kW","kW","uur/ha","uur/ha","uur/ha","uur/ha","%","%",null,null,null,"l/ kW","%","gewicht (kg)","countus waarden"]
[1,"Cultivator schijf","2500-10000",2500,10000,6250,"70-150",70,150,110,"0,75-1",0.75,1,0.875,6,2.5,0,0,null,0.30499999999999999,70,1750,"1000 - 2500"]
[2,"Cultivator vaste tand","3750-20000",3750,20000,11875,"70-150",70,150,110,"0,75-1",0.75,1,0.875,6,3.5,0,0,null,0.30499999999999999,70,1125,"750 - 1500"]
[3,"Cultivator veertand","5130-35000",5130,35000,20065,"70-150",70,150,110,"0,75-1",0.75,1,0.875,6,2.5,0,0,null,0.30499999999999999,70,1125,"750 - 1500"]
[4,"Stoppelcultivator","4000-6000",4000,6000,5000,"70-125",70,125,97.5,"0,75-1",0.75,1,0.875,6,3,0,0,null,0.30499999999999999,70,1125,"750 - 1500"]
[5,"Frontpakker","3500-6000",3500,6000,4750,50,50,50,50,"0,75-1",0.75,1,0.875,7.5,2.5,0,0,null,0.30499999999999999,70,1125,"750 - 1500"]
[6,"Grondfrees","950-11000",950,11000,5975,"70-125",70,125,97.5,"1,5-2,5",1.5,2.5,2,9,3,0,0,null,0.30499999999999999,70,1500,"1000 - 2000"]
[7,"Hakenfrees","6000-16800",6000,16800,11400,"70-125",70,125,97.5,"1,5-2,5",1.5,2.5,2,9,3,0,0,null,0.30499999999999999,70,1500,"1000 - 2000"]
[8,"Rotorkopeg","8000-44000",8000,44000,26000,"70-150",70,150,110,"0,8-1,2",0.8,1.2,1,7.5,3.5,0,0,null,0.30499999999999999,70,1325,"750 - 2000"]
[9,"Schijveneg","4500-50000",4500,50000,27250,"70-150",70,150,110,"0,8-1,2",0.8,1.2,1,7.5,3.5,0,0,null,0.30499999999999999,70,1750,"1000 - 2500"]
[10,"Spitmachine","25000-42000",25000,42000,33500,"70-150",70,150,110,"1,5-2",1.5,2,1.75,9,3.5,0,0,null,0.30499999999999999,70,1750,"1001 - 2500"]
[11,"Volveldsfrees","14500-20000",14500,20000,17250,"70-125",70,125,97.5,"1,5-2,5",1.5,2.5,2,9,3.5,0,0,null,0.30499999999999999,70,1500,"1000 - 2000"]
[12,"Voorzetwoeler","5300-8000",5300,8000,6650,"70-125",70,125,97.5,"0,8-1,2",0.8,1.2,1,4.5,2,0,0,null,0.30499999999999999,70,750,"500 - 1000"]
[13,"Vorenpakker enkel of dubbel","2000-9800",2000,9800,5900,"40-70",40,70,55,0.5,0.5,0.5,0.5,7.5,1.5,0,0,"extra",0.30499999999999999,70,1125,"750 - 1500"]
[14,"Vorenpakker frontopbouw","3000-15000",3000,15000,9000,"40-70",40,70,55,0.5,0.5,0.5,0.5,7.5,1.5,0,0,"extra",0.30499999999999999,70,1125,"750 - 1500"]
[15,"Wentelploeg","20000-55000",20000,55000,37500,"70-150",70,150,110,"1,5-2",1.5,2,1.75,7.5,5,0,0,null,0.30499999999999999,70,2250,"1500 - 3000"]
[16,"Woeler","2000-14000",2000,14000,8000,"70-100",70,100,85,"0,8-1,2",0.8,1.2,1,4.5,2,0,0,null,0.30499999999999999,70,750,"500 - 1000"]
[17,"Zaaibedcombinatie gedragen","3500-25000",3500,25000,14250,"70-125",70,125,97.5,"0,5-1",0.5,1,0.75,6,2,0,0,null,0.30499999999999999,70,1250,"500 - 2000"]
[18,"Duwploeg","15000-20000",15000,20000,17500,"40-70",40,70,55,0.5,0.5,0.5,0.5,7.5,5,0,0,"extra",0.30499999999999999,70,1500,"1000 - 2000"]
[19,"Rupsbanden",null,null,null,null,null,null,null,null,null,null,null,null,"?","?",0,0,null,0.30499999999999999,70,500,"500"]
[20,"Techniek + vasterijpaden",null,null,null,null,null,null,null,null,null,null,null,null,"?","?",0,0,null,0.30499999999999999,70,0.1]
[]
[]
[]
[]
[]
[null,2,3,4,5,6,7,8,9,10,11,12,13,14,15,16,17,18,19,20,21,22]
["Rekenwaarde","Check"]
[1,{"$f":"IF(ISNA(VLOOKUP($A$31,$A$4:$U$23,B29,FALSE)),\"\",VLOOKUP($A$31,$A$2:$U$23,B29,FALSE))","v":"Cultivator schijf"},{"$f":"IF(ISNA(VLOOKUP($A$31,$A$4:$U$23,C29,FALSE)),\"\",VLOOKUP($A$31,$A$2:$U$23,C29,FALSE))","v":"2500-10000"},{"$f":"IF(ISNA(VLOOKUP($A$31,$A$4:$U$23,D29,FALSE)),\"\",VLOOKUP($A$31,$A$2:$U$23,D29,FALSE))","v":2500},10000,{"$f":"IF(ISNUMBER(F33),F33,VLOOKUP($A$31,$A$2:$U$23,F29,FALSE))","v":6250},"70-150",70,150,{"$f":"IF(ISNUMBER(J33),J33,VLOOKUP($A$31,$A$2:$U$23,J29,FALSE))","v":110},"0,75-1",0.75,1,{"$f":"IF(ISNUMBER(N33),N33,VLOOKUP($A$31,$A$2:$U$23,N29,FALSE))","v":0.875},{"$f":"IF(ISNUMBER(O33),O33,VLOOKUP($A$31,$A$2:$U$23,O29,FALSE))","v":6},{"$f":"IF(ISNUMBER(P33),P33,VLOOKUP($A$31,$A$2:$U$23,P29,FALSE))","v":2.5},0,0,0,{"$f":"IF(ISNUMBER(T33),T33,VLOOKUP($A$31,$A$2:$U$23,T29,FALSE))","v":0.30499999999999999},{"$f":"IF(ISNUMBER(U33),U33,VLOOKUP($A$31,$A$2:$V$23,U29,FALSE))","v":70},{"$f":"IF(ISNUMBER(V33),V33,VLOOKUP($A$31,$A$2:$V$23,V29,FALSE))","v":1750}]
["Handmatig aangepast"]
[null,null,null,null,null,"",null,null,null,"",null,null,null,"","","",null,null,null,"","",""]

{"sheet":"Watermanagement","index":16,"n_rows":0,"n_cols":0,"rows_kept":0,"cut":false,"hidden":true,"merged":[]}

{"sheet":"crop residue paludi","index":17,"n_rows":45,"n_cols":17,"rows_kept":45,"cut":false,"hidden":true,"merged":[[0,0,1,0],[0,2,1,2],[0,3,1,3],[0,4,1,4],[0,5,1,5],[0,16,7,20],[2,1,17,1],[2,2,7,2],[2,3,7,3],[8,2,9,2],[8,3,9,3],[10,2,11,2],[10,3,11,3],[10,5,11,5],[10,14,11,14],[0,6,1,6],[12,2,13,2],[12,3,13,3],[12,5,13,5],[12,14,13,14],[14,2,15,2],[14,3,15,3],[16,2,17,2],[16,3,17,3],[16,5,17,5],[18,0,33,0],[18,1,33,1],[18,2,26,2],[18,3,26,3],[29,14,30,14],[31,2,33,2],[31,3,33,3],[34,0,38,0],[34,1,38,1],[34,2,38,2],[34,3,38,3],[34,6,38,6],[18,6,33,6],[27,2,28,2],[27,3,28,3],[27,5,28,5],[29,2,30,2],[29,3,30,3],[29,5,30,5],[39,1,42,1],[39,2,40,2],[39,3,40,3],[39,14,40,14],[41,2,42,2],[41,3,42,3],[41,5,42,5],[41,14,42,14],[43,0,44,0],[43,1,44,1],[43,2,44,2],[43,3,44,3],[43,6,44,6]]}
["Crop","Water level","Product","Potential for carbon credits","Potential for blue credits","Existing production areas including pilots (in ha) and potential areas (in italics)","References",null,null,null,null,null,null,null,null,null,"Table 1. Overview of important paludiculture crops and applications, range in water levels, existing production areas including pilots and potential areas, potential for carbon credits based on estimates of GHG emission reduction (including biomass use for replacing fossil resources), and potential for blue credits based on suitability for water purification (P) and water storage (S): ++ very high potential, + high potential, 0 little potential, - negative effect."]
[null,"(cm +/- soil surface)",null,null,null,null,null,"Oogstijd","Lengte stoppel (m)","Totale lengte spruit (m)",null,"Oogst ton DS/ha min/max","Oogstrest (ton ds/ha)","bron","Opmerking"]
["Cattail","0 to +20","insulation and building material","+","P +","Kamp (D) 30","Pijlman et al., 2019"]
["(Typha sp.)",null,null,null,"S +","Zuiderveen (NL) 4","Rejmankova 2011"]
[null,null,null,null,null,"Peel (NL) 1","Vroom et al., 2018","nov - feb",0.25,1.8,{"$f":"I5/((1.8+2.5)/2)","v":0.11627906976744186},5,{"$f":"(L5/(J5-I5))*I5","v":0.80645161290322576},"Paetzel 2018"]
[null,null,null,null,null,"Bûtefjild (NL) 0.1","Yavitt and Knapp, 1995","nov - feb",0.25,2.5,null,15,{"$f":"(L6/(J6-I6))*I6","v":1.6666666666666667},"Wichtmann et al. 2016"]
[null,null,null,null,null,"Danube delta (RO)","Wild et al., 2001"]
[null,null,null,null,null,null,"Heinz, 2012"]
[null,null,"bedding material","+","P +","Peel (NL) 1","Geurts and Fritz, 2018","nov - feb",0.25,1.8,null,5,{"$f":"(L9/(J9-I9))*I9","v":0.80645161290322576},null,null,null,"Short position paper in Landbauforschung Journal of Sustainable and Organic Agricultural Systems"]
[null,null,null,null,"S +","Zegveld (NL) 0.4","Grosshans et al., 2013","nov - feb",0.25,2.5,null,15,{"$f":"(L10/(J10-I10))*I10","v":1.6666666666666667}]
[null,null,"extraction of protein, fibres, cellulose","0/+","P ++","Canada","Chakma et al., 2017","juli - aug?",0.25,1.8,null,{"$f":"L5/3*4","v":6.666666666666667},{"$f":"(L11/(J11-I11))*I11","v":1.075268817204301},null,"opbrengst verhouding tot winteroogst gebaseerd op Pijlman et al. 2019",null,"Climate mitigation and provision of ecosystem services on rewetted peat soils used for paludiculture"]
[null,null,null,null,"S +",null,"Zhang et al., 2011",null,0.25,2.5,null,{"$f":"L6/3*4","v":20},{"$f":"(L12/(J12-I12))*I12","v":2.2222222222222223},null,null,null,"J.J.M. Geurts, G.A. van Duinen, J. van Belle, S. Wichmann, W. Wichtmann & C. Fritz"]
[null,null,"feed for pest-controlling predatory mites","0/+","P ++","Zegveld (NL) 0.4","Rahman et al., 2015","mei - juni","n/a",null,null,null,"n/a",null,"oogst betreft het stuifmeel. Wordt dus gecombineerd met andere oogst"]
[null,null,null,null,"S +",null,null,null,"n/a",null,null,null,"n/a"]
[null,null,"fodder","-/+","P ++","Peel (NL) 1 ha",null,"mei",0.25,0.6,null,3,{"$f":"(L15/(J15-I15))*I15","v":2.1428571428571428},"Pijlman et al. 2019"]
[null,null,null,null,"S +","Zegveld (NL) 0.4"]
[null,null,"combustion","-/+","P +","Canada > 500",null,"nov - feb",0.25,1.8,null,5,{"$f":"(L17/(J17-I17))*I17","v":0.80645161290322576}]
[null,null,null,null,"S +",null,null,null,0.25,2.5,null,15,{"$f":"(L18/(J18-I18))*I18","v":1.6666666666666667}]
["Reed (Phragmites australis)","-20 to +20","thatching, insulation and building material","++","P +","UK 6,500","Van den Berg et al., 2016; Rezaie and Sahlezadeh, 2014; Köbbing et al., 2013; Wichmann and Köbbing, 2015; Wichtmann et al., 2014; Van der Sluis et al., 2013; Dragoni et al., 2017; Wichtmann et al., 2016"]
[null,null,null,null,"S ++","Netherlands 4,500"]
[null,null,null,null,null,"Mecklenburg-Vorpommern (D) 550",null,"nov/feb",0.1,2,{"$f":"I21/((1.8+2.5)/2)","v":4.651162790697675E-2},8,{"$f":"(L21/(J21-I21))*I21","v":0.42105263157894735},"Wichtmann et al. 2016"]
[null,null,null,null,null,"Poland 8,000",null,null,0.1,3,null,"?",null,null,"geen info over max. yield gevonden"]
[null,null,null,null,null,"Hungary 7,500"]
[null,null,null,null,null,"Austria 1,500"]
[null,null,null,null,null,"Denmark, China"]
[null,null,null,null,null,"Romania 190,000"]
[null,null,null,null,null,"Ukraine >100,000"]
[null,null,"paper","++/+","P +","China > 1 million",null,"nov/feb",0.1,2,null,8,{"$f":"(L28/(J28-I28))*I28","v":0.42105263157894735},"Wichtmann et al. 2016"]
[null,null,null,null,"S ++",null,null,null,0.1,3,null,"?",null,null,"geen info over max. yield gevonden"]
[null,null,"extraction of protein, fibres, cellulose","0/+","P +/++","Germany",null,null,0.1,2,null,8,{"$f":"(L30/(J30-I30))*I30","v":0.42105263157894735},"Wichtmann et al. 2016","dit gaat uit van winteroogst, omdat oogst tijdens groeiseizoen slecht wordt verdragen door Riet"]
[null,null,null,null,"S ++",null,null,"nov/feb??",0.1,3,null,"?"]
[null,null,"combustion/ biogas","-/+","P +/++","Italy 0.75",null,null,0.1,2,null,8,{"$f":"(L32/(J32-I32))*I32","v":0.42105263157894735},"Wichtmann et al. 2016"]
[null,null,null,null,"S ++","Germany",null,"nov/feb",0.1,3,null,"?",null,null,"geen info over max. yield gevonden"]
[null,null,null,null,null,"Belarus & Ukraine: large potential areas"]
["Peat moss (Sphagnum sp.)","-15 to -5","high quality substrate in  horticulture","++","P +","Hankhausen (D) 14","Beyer and Höper, 2015; Temmink et al., 2017; Günther et al., 2017; Gaudig et al. 2018"]
[null,null,null,null,"S 0/+","Twist (D) 10",null,null,null,null,null,null,0,null,"geen oogstrest, want oogst is plant + dode plant"]
[null,null,null,null,null,"Ilperveld (NL) 8",null,null,"???"]
[null,null,null,null,null,"Canada 8",null,null,null,null,null,null,null,null,null,null,"oogstmomenten lisdodde"]
[null,null,null,null,null,"Finland, Chile",null,null,null,null,null,null,null,null,null,null,"uit Geurts et al 2017 - Paludicultuur houdt de polder schoon. H2O online"]
["Grasses like reed canary grass ","-30 to +10","combustion/ biogas","-/+","P 0","Malchin (D) 200","Hurry and Bellinger, 1990;",null,"mei - sep",null,null,null,"?",null,"vergelijkbaar met ander grasland, maar minder eiwitrijk"]
["(Phalaris arundinacea)",null,null,null,"S +","Denmark, Estonia, Belarus","Kao et al., 2003; "]
[null,null,"fodder","0/+","P 0/+","Mecklenburg-Vorpommern (D)","Karki et al., 2014; Wichtmann et al., 2016",null,"mei - sep",null,null,null,"?",null,"vergelijkbaar met ander grasland, maar minder eiwitrijk"]
[null,null,null,null,"S +"]
["Alder (Alnus sp.)","-40 to +5","wood/timber","++","P 0/+","Mecklenburg-Vorpommern (D) 40,000","Abel 2016; Rusch and Rennenberg, 1998; Schäfer and Joosten, 2005",null,"jan - feb?",null,null,null,0,null,"geen oogstrest, want stobben groeien weer uit"]
[null,null,null,null,"S ++","USA"]