{"text_format":"1","workbook":"xlsx","n_sheets":15,"sheets":["Manual DST"," Input oud","Input","Overall results","Results PHA","calc results PHA","factsheet PHA","Results Lipids for Bio-diesel","calc results lipids","factsheet Lipids for Bio-diesel","Results Oil-Char-Acetic acid","calc results cellulose","factsheet Oil-Char-Acetic Acid","Decision rules"," lists & calculation "],"not_rendered":{"charts":6,"images":15,"macros":1,"external_links":0,"defined_names":5,"comments":8,"pivot_tables":0},"unopened":[],"bounds":{"document_bytes":16777216,"sheet_cells":100000,"rows_first":2000,"rows_last":500,"rows_between":2000,"halvings":0,"cell_chars":16384,"cell_head_chars":4096},"cells_cut":0,"cells_raw":0,"read":"whole","date_system":"1900"}

{"sheet":"Manual DST","index":0,"n_rows":40,"n_cols":2,"rows_kept":40,"cut":false,"hidden":false,"merged":[]}
[]
[]
[]
[]
[]
[]
[]
[]
{"$rows_left_out":33}
{"sheet":" Input oud","index":1,"n_rows":22,"n_cols":26,"rows_kept":22,"cut":false,"hidden":true,"merged":[[19,2,19,8],[9,1,9,2],[4,1,4,2],[5,1,5,2],[6,1,6,2],[7,1,7,2],[8,1,8,2],[10,1,10,2],[14,1,14,2],[15,1,15,3],[11,1,11,2],[12,1,12,2],[13,1,13,2],[10,6,11,6]]}
[null,"DECISION SUPPORT TOOL"]
[null,null,null,null,null,null,null,null,null,null,null,"primary treatment",null,"% households",null,"amount PE","households&PE","BOD/COD",null,"COD",null,null,null,null,"Overall"]
[]
[null,null,null,"INPUT COLUMN \n(add your information in this column)","PHA\n(bioplastics)","Bio-diesel\n(from lipids)","Oil - Char - Acetic Acid\n(from cellulose)",null,null,null,"PHA",{"$f":"IF($D$9=\"No\",0,IF($D$9=\"Yes\",2,\"\"))","v":2},null,null,null,{"$f":"IF(AND(D12<=40000,D12>0),0,IF(D12>=80000,2,IF(AND(D12>=40000,D12<=79999),1,\"\")))","v":1},null,{"$f":"IF(AND(D13<=0.2,D13>0),0,IF(D13>=0.4,2,IF(AND(D13>=0.2,D13<=0.4),1,\"\")))","v":""},null,null,null,{"$f":"IF(AND(#REF!<=50000,#REF!>0),0,IF(#REF!>=100000,2,IF(AND(#REF!>=50000,#REF!<=99999),1,\"\")))","v":{"$error":"#REF!"}},null,"alles groen",{"$f":"AND(L4=2,P4=2,R4=2)","v":false},{"$f":"IF(Y4=TRUE,1,0)","v":0}]
[null,"General information",null,null,null,null,null,null,null,null,null,"no = 0",null,null,null,"<40000 = 0",null,"<0,2 = 0",null,null,null,null,null,"min 1 oranje ",{"$f":"OR(L4=0,P4=0,R4=0)","v":false},{"$f":"IF(Y5=TRUE,1,0)","v":0}]
[null,"Name stream / sewage treatment plant",null,null,null,null,null,null,null,null,null,null,null,null,null,"40000 - 80000 = 1",null,"0,2 - 0,4 = 1",null,null,null,null,null,"min 1 geel ",{"$f":"OR(L4=1,P4=1,R4=1)","v":true},{"$f":"IF(Y6=\"WAAR\",1,0)","v":0}]
[null,"Location",null,null,null,null,null,null,null,null,null,"yes = 2",null,null,null,">80000 = 2",null,">0,4 = 2"]
[null,"Current set-up of sewage treatment plant"]
{"$rows_left_out":15}
{"sheet":"Input","index":2,"n_rows":65,"n_cols":8,"rows_kept":65,"cut":false,"hidden":false,"merged":[[3,0,3,11],[5,0,5,11],[7,0,7,11],[4,0,4,11],[10,3,10,6]]}
["DECISION SUPPORT TOOL - DATA INPUT"]
[]
["INSTRUCTION"]
["* In this tab 'input' you can fill in data from up to 50 sewage treatment plants. Information can be filled in in the cells coloured n and n"]
["* A) First you have to choose which method is used to calculate the population equivalent for the sewage treatment plants that you are testing. There is an option menu for this (row 11)."]
["* B) gives the standard value for the BOD/COD-ratio that will be used in the calculation if no BOD and/or COD concentration is filled in in column G and/or H. In this case, a standard BOD/COD-ratio of 0,5 will be used in the \n   Decision Support Tool. This value is based on average BOD/COD ratios in the influent of sewage treatment plants in Europe. The standard BOD/COD ratio can be changed in this cell if you have information about the actual \n   BOD/COD ratios of the influent at your sewage treatment plants."]
["* In Column A and B you can put in information about the name a the sewage treatment plant and the location (city, region)"]
["* In column D, E, F, G and H you have to fill in specific information about (the influent of) the sewage treatment plant. Column D and F have an option menu. Additional information can be found in the cells with a red \n    triangle if you move your cursor over the cell."]
{"$rows_left_out":58}
{"sheet":"Overall results","index":3,"n_rows":55,"n_cols":11,"rows_kept":55,"cut":false,"hidden":false,"merged":[[22,8,22,23],[23,8,23,23],[24,8,24,23],[26,8,26,23],[24,7,25,7],[25,8,25,23]]}
[]
[null,"DECISION SUPPORT TOOL - RESULTS OVERALL"]
[]
[null,"Name Sewage Treatment Plant","Location","PHA\n(bioplastics)","Bio-diesel\n(from lipids)","Oil - Char - Acetic Acid\n(from cellulose)"]
[]
[1,{"$f":"IF(Input!B16=\"\",\"\",Input!B16)","v":""},{"$f":"IF(Input!C16=\"\",\"\",Input!C16)","v":""}]
[2,{"$f":"IF(Input!B17=\"\",\"\",Input!B17)","v":""},{"$f":"IF(Input!C17=\"\",\"\",Input!C17)","v":""}]
[3,{"$f":"IF(Input!B18=\"\",\"\",Input!B18)","v":""},{"$f":"IF(Input!C18=\"\",\"\",Input!C18)","v":""}]
{"$rows_left_out":48}
{"sheet":"Results PHA","index":4,"n_rows":55,"n_cols":12,"rows_kept":55,"cut":false,"hidden":false,"merged":[[27,11,27,28],[28,11,28,28],[24,11,24,28],[25,10,26,10],[23,11,23,28],[25,11,25,28],[26,11,26,28]]}
[]
[null,"DECISION SUPPORT TOOL - RESULTS PHA"]
[]
[null,"Name Sewage Treatment Plant","Location","Primary treatment","Percentage sewage from households","Amount of \nPopulation Equivalents","BOD/COD","COD","OVERALL"]
[null,null,null,"yes/no","%","PE","--","mg/l"]
[1,{"$f":"IF(Input!B16=\"\",\"\",Input!B16)","v":""},{"$f":"IF(Input!C16=\"\",\"\",Input!C16)","v":""},{"$f":"IF(Input!D16=\"\",\"\",Input!D16)","v":""},null,{"$f":"IF(Input!F16=\"\",\"\",Input!F16)","v":""},{"$f":"IF(AND(Input!G16=\"\",Input!H16=\"\"),\"\",(IF(Input!H16=\"\",Input!$D$12,(IF(Input!G16=\"\",Input!$D$12,(Input!G16/Input!H16))))))","v":""}]
[2,{"$f":"IF(Input!B17=\"\",\"\",Input!B17)","v":""},{"$f":"IF(Input!C17=\"\",\"\",Input!C17)","v":""},{"$f":"IF(Input!D17=\"\",\"\",Input!D17)","v":""},null,{"$f":"IF(Input!F17=\"\",\"\",Input!F17)","v":""},{"$f":"IF(AND(Input!G17=\"\",Input!H17=\"\"),\"\",(IF(Input!H17=\"\",Input!$D$12,(IF(Input!G17=\"\",Input!$D$12,(Input!G17/Input!H17))))))","v":""}]
[3,{"$f":"IF(Input!B18=\"\",\"\",Input!B18)","v":""},{"$f":"IF(Input!C18=\"\",\"\",Input!C18)","v":""},{"$f":"IF(Input!D18=\"\",\"\",Input!D18)","v":""},null,{"$f":"IF(Input!F18=\"\",\"\",Input!F18)","v":""},{"$f":"IF(AND(Input!G18=\"\",Input!H18=\"\"),\"\",(IF(Input!H18=\"\",Input!$D$12,(IF(Input!G18=\"\",Input!$D$12,(Input!G18/Input!H18))))))","v":""}]
{"$rows_left_out":48}
{"sheet":"calc results PHA","index":5,"n_rows":57,"n_cols":19,"rows_kept":57,"cut":false,"hidden":true,"merged":[]}
[]
[null,"DECISION SUPPORT TOOL - calculation sheet PHA"]
[]
[]
[]
[null,"Name Sewage Treatment Plant","Location","Primary treatment","Percentage sewage from households","calculation PE","calculation PE","Amount of \nPE","BOD/COD","COD","OVERALL",null,"alles groen","min 1 oranje ","min 1 geel ","overall"]
[null,null,null,"yes/no","%",null,null,"PE","--","mg/l"]
[1,{"$f":"IF(Input!B16=\"\",\"\",Input!B16)","v":""},{"$f":"IF(Input!C16=\"\",\"\",Input!C16)","v":""},{"$f":"IF(Input!D16=\"No\",0,IF(Input!D16=\"Yes\",2,\"\"))","v":""},null,{"$f":"IF(Input!$D$11=' lists & calculation '!$G$3,1,IF(Input!$D$11=' lists & calculation '!$G$4,2,IF(Input!$D$11=' lists & calculation '!$G$5,3,IF(Input!$D$11=' lists & calculation '!$G$6,4,IF(Input!$D$11=' lists & calculation '!$G$7,5,IF(Input!$D$11=' lists & calculation '!$G$8,6,\"\"))))))","v":""},{"$f":"IF(Input!F16=\"\",\"\",IF(F8=1,Input!F16*1.128,IF(F8=2,Input!F16*0.9,IF(F8=3,Input!F16*1.2,IF(F8=4,Input!F16,IF(F8=5,Input!F16,IF(F8=6,Input!F16*1.333,\"\")))))))","v":""},{"$f":"IF(G8=\"\", \"\",IF(AND(G8<=50000,G8>0),0,IF(G8>=100000,2,1)))","v":""},{"$f":"IF('Results PHA'!G6=\"\",\"\",(IF(AND('Results PHA'!G6<=0.2,'Results PHA'!G6>0),0,IF('Results PHA'!G6>=0.4,2,IF(AND('Results PHA'!G6>=0.2,'Results PHA'!G6<=0.4),1,\"\")))))","v":""},null,{"$f":"IF(OR(D8=\"\",H8=\"\",I8=\"\"),\"\",IF(M8=TRUE,2,(IF(O8=TRUE,1,0))))","v":""},null,{"$f":"IF(AND(D8=\"\",H8=\"\",I8=\"\"),\"\",AND(D8=2,H8=2,I8=2))","v":""},{"$f":"IF(AND(D8=\"\",H8=\"\",I8=\"\"),\"\",OR(D8=0,H8=0,I8=0))","v":""},{"$f":"IF(AND(D8=\"\",H8=\"\",I8=\"\"),\"\",OR(D8=1,H8=1,I8=1))","v":""},{"$f":"IF(AND(D8=\"\",H8=\"\",I8=\"\"),\"\",IF(M8=TRUE,2,(IF(O8=TRUE,1,0))))","v":""}]
{"$rows_left_out":50}
{"sheet":"factsheet PHA","index":6,"n_rows":30,"n_cols":3,"rows_kept":30,"cut":false,"hidden":false,"merged":[[45,7,45,8],[46,7,46,8],[47,7,47,8],[31,6,31,8],[40,6,40,8],[38,7,38,8],[41,7,41,8],[42,7,42,8],[43,7,43,8],[44,7,44,8],[33,7,33,8],[34,7,34,8],[35,7,35,8],[36,7,36,8],[37,7,37,8],[8,1,8,3],[13,1,13,3],[17,1,17,3],[21,1,21,3],[32,7,32,8],[20,1,20,2],[25,1,25,2],[27,1,27,2]]}
[null,"MICROBIAL PRODUCTION OF PHA FROM PRIMARY SLUDGE"]
[]
[null,"Possible effects on other processes of sewage treatment plant"]
[]
[null,null,"implementation of microbial PHA production has no impact on this process"]
[null,null,"implementation of microbial PHA production POSSIBLY has an effect on this process"]
[null,null,"implementation of microbial PHA production has an effect on this process"]
[]
{"$rows_left_out":23}
{"sheet":"Results Lipids for Bio-diesel","index":7,"n_rows":55,"n_cols":12,"rows_kept":55,"cut":false,"hidden":false,"merged":[[27,11,27,28],[28,11,28,28],[25,10,26,10],[23,11,23,28],[24,11,24,28],[25,11,25,28],[26,11,26,28]]}
[]
[null,"DECISION SUPPORT TOOL - RESULTS LIPIDS FOR BIO-DIESEL"]
[]
[null,"Name Sewage Treatment Plant","Location","Primary treatment","Percentage sewage from households","Amount of \nPopulation Equivalents","BOD/COD","COD","OVERALL"]
[null,null,null,"yes/no","%","PE","--","mg/l"]
[1,{"$f":"IF(Input!B16=\"\",\"\",Input!B16)","v":""},{"$f":"IF(Input!C16=\"\",\"\",Input!C16)","v":""},null,null,{"$f":"IF(Input!F16=\"\",\"\",Input!F16)","v":""},{"$f":"IF(AND(Input!G16=\"\",Input!H16=\"\"),\"\",(IF(Input!H16=\"\",Input!$D$12,(IF(Input!G16=\"\",Input!$D$12,(Input!G16/Input!H16))))))","v":""},{"$f":"IF(Input!H16=\"\",\"\",Input!H16)","v":""}]
[2,{"$f":"IF(Input!B17=\"\",\"\",Input!B17)","v":""},{"$f":"IF(Input!C17=\"\",\"\",Input!C17)","v":""},null,null,{"$f":"IF(Input!F17=\"\",\"\",Input!F17)","v":""},{"$f":"IF(AND(Input!G17=\"\",Input!H17=\"\"),\"\",(IF(Input!H17=\"\",Input!$D$12,(IF(Input!G17=\"\",Input!$D$12,(Input!G17/Input!H17))))))","v":""},{"$f":"IF(Input!H17=\"\",\"\",Input!H17)","v":""}]
[3,{"$f":"IF(Input!B18=\"\",\"\",Input!B18)","v":""},{"$f":"IF(Input!C18=\"\",\"\",Input!C18)","v":""},null,null,{"$f":"IF(Input!F18=\"\",\"\",Input!F18)","v":""},{"$f":"IF(AND(Input!G18=\"\",Input!H18=\"\"),\"\",(IF(Input!H18=\"\",Input!$D$12,(IF(Input!G18=\"\",Input!$D$12,(Input!G18/Input!H18))))))","v":""},{"$f":"IF(Input!H18=\"\",\"\",Input!H18)","v":""}]
{"$rows_left_out":48}
{"sheet":"calc results lipids","index":8,"n_rows":57,"n_cols":19,"rows_kept":57,"cut":false,"hidden":true,"merged":[]}
[]
[null,"DECISION SUPPORT TOOL - calculation sheet PHA"]
[]
[]
[]
[null,"Name Sewage Treatment Plant","Location","Primary treatment","Percentage sewage from households","calculation PE","calculation PE","Amount of \nPE","BOD/COD","COD","OVERALL",null,"alles groen","min 1 oranje ","min 1 geel ","overall"]
[null,null,null,"yes/no","%",null,null,"PE","--","mg/l"]
[1,{"$f":"IF(Input!B16=\"\",\"\",Input!B16)","v":""},{"$f":"IF(Input!C16=\"\",\"\",Input!C16)","v":""},null,null,{"$f":"IF(Input!$D$11=' lists & calculation '!$G$3,1,IF(Input!$D$11=' lists & calculation '!$G$4,2,IF(Input!$D$11=' lists & calculation '!$G$5,3,IF(Input!$D$11=' lists & calculation '!$G$6,4,IF(Input!$D$11=' lists & calculation '!$G$7,5,IF(Input!$D$11=' lists & calculation '!$G$8,6,\"\"))))))","v":""},{"$f":"IF(Input!F16=\"\",\"\",IF(F8=1,Input!F16*1.128,IF(F8=2,Input!F16*0.9,IF(F8=3,Input!F16*1.2,IF(F8=4,Input!F16,IF(F8=5,Input!F16,IF(F8=6,Input!F16*1.333,\"\")))))))","v":""},{"$f":"IF(G8=\"\", \"\",IF(AND(G8<=20000,G8>0),0,IF(G8>=50000,2,1)))","v":""},{"$f":"IF('Results Lipids for Bio-diesel'!G6=\"\",\"\",(IF(AND('Results Lipids for Bio-diesel'!G6<=0.2,'Results Lipids for Bio-diesel'!G6>0),0,IF('Results Lipids for Bio-diesel'!G6>=0.4,2,IF(AND('Results Lipids for Bio-diesel'!G6>=0.2,'Results Lipids for Bio-diesel'!G6<=0.4),1,\"\")))))","v":""},{"$f":"IF(AND(Input!H16<=450,Input!H16>0),0,IF(Input!H16>=600,2,IF(AND(Input!H16>=450,Input!H16<=599),1,\"\")))","v":""},{"$f":"IF(OR(J8=\"\",H8=\"\",I8=\"\"),\"\",IF(M8=TRUE,2,(IF(O8=TRUE,1,0))))","v":""},null,{"$f":"IF(AND(J8=\"\",H8=\"\",I8=\"\"),\"\",AND(J8=2,H8=2,I8=2))","v":""},{"$f":"IF(AND(J8=\"\",H8=\"\",I8=\"\"),\"\",OR(J8=0,H8=0,I8=0))","v":""},{"$f":"IF(AND(J8=\"\",H8=\"\",I8=\"\"),\"\",OR(J8=1,H8=1,I8=1))","v":""},{"$f":"IF(AND(J8=\"\",H8=\"\",I8=\"\"),\"\",IF(M8=TRUE,2,(IF(O8=TRUE,1,0))))","v":""}]
{"$rows_left_out":50}
{"sheet":"factsheet Lipids for Bio-diesel","index":9,"n_rows":30,"n_cols":3,"rows_kept":30,"cut":false,"hidden":false,"merged":[[43,7,43,8],[44,7,44,8],[45,7,45,8],[46,7,46,8],[47,7,47,8],[37,7,37,8],[38,7,38,8],[40,6,40,8],[41,7,41,8],[42,7,42,8],[32,7,32,8],[33,7,33,8],[34,7,34,8],[35,7,35,8],[36,7,36,8],[8,1,8,3],[13,1,13,3],[17,1,17,3],[21,1,21,3],[31,6,31,8],[20,1,20,2],[26,1,26,2],[27,1,27,2],[16,1,16,2],[15,1,15,2]]}
[null,"LIPID ACCUMULATION IN MICROTHRIX TO PRODUCE (BIO)DIESEL"]
[]
[null,"Possible effects on other processes of sewage treatment plant"]
[]
[null,null,"implementation of lipid accumulation in Microthrix has no impact on this process"]
[null,null,"implementation of lipid accumulation in Microthrix POSSIBLY has an effect on this process"]
[null,null,"implementation of lipid accumulation in Microthrix has an effect on this process"]
[]
{"$rows_left_out":23}
{"sheet":"Results Oil-Char-Acetic acid","index":10,"n_rows":55,"n_cols":12,"rows_kept":55,"cut":false,"hidden":false,"merged":[[27,11,27,28],[28,11,28,28],[25,10,26,10],[23,11,23,28],[24,11,24,28],[25,11,25,28],[26,11,26,28]]}
[]
[null,"DECISION SUPPORT TOOL - RESULTS OIL - CHAR - ACETIC ACID"]
[]
[null,"Name Sewage Treatment Plant","Location","Primary treatment","Percentage sewage from households","Amount of \nPopulation Equivalents","BOD/COD","COD","OVERALL"]
[null,null,null,"yes/no","%","PE","--","mg/l"]
[1,{"$f":"IF(Input!B16=\"\",\"\",Input!B16)","v":""},{"$f":"IF(Input!C16=\"\",\"\",Input!C16)","v":""},null,{"$f":"IF(Input!E16=\"\",\"\",Input!E16)","v":""},{"$f":"IF(Input!F16=\"\",\"\",Input!F16)","v":""}]
[2,{"$f":"IF(Input!B17=\"\",\"\",Input!B17)","v":""},{"$f":"IF(Input!C17=\"\",\"\",Input!C17)","v":""},null,{"$f":"IF(Input!E17=\"\",\"\",Input!E17)","v":""},{"$f":"IF(Input!F17=\"\",\"\",Input!F17)","v":""}]
[3,{"$f":"IF(Input!B18=\"\",\"\",Input!B18)","v":""},{"$f":"IF(Input!C18=\"\",\"\",Input!C18)","v":""},null,{"$f":"IF(Input!E18=\"\",\"\",Input!E18)","v":""},{"$f":"IF(Input!F18=\"\",\"\",Input!F18)","v":""}]
{"$rows_left_out":48}
{"sheet":"calc results cellulose","index":11,"n_rows":57,"n_cols":26,"rows_kept":57,"cut":false,"hidden":true,"merged":[]}
[]
[null,"DECISION SUPPORT TOOL - calculation sheet Oil-Char-Acetic acid"]
[]
[]
[]
[null,"Name Sewage Treatment Plant","Location","Primary treatment","Percentage sewage from households","calculation PE","calculation PE","Amount of \nPE","PE and %HH combined","PE and %HH translated to 0,1,2","BOD/COD","COD","OVERALL",null,"alles groen","min 1 oranje ","min 1 geel ","overall"]
[null,null,null,"yes/no","%",null,null,"PE",null,null,"--","mg/l"]
[1,{"$f":"IF(Input!B16=\"\",\"\",Input!B16)","v":""},{"$f":"IF(Input!C16=\"\",\"\",Input!C16)","v":""},null,{"$f":"IF(Input!E16=\"<25%\",1,IF(Input!E16=\">50%\",3,IF(Input!E16=\"25-50%\",2,\"\")))","v":""},{"$f":"IF(Input!$D$11=' lists & calculation '!$G$3,1,IF(Input!$D$11=' lists & calculation '!$G$4,2,IF(Input!$D$11=' lists & calculation '!$G$5,3,IF(Input!$D$11=' lists & calculation '!$G$6,4,IF(Input!$D$11=' lists & calculation '!$G$7,5,IF(Input!$D$11=' lists & calculation '!$G$8,6,\"\"))))))","v":""},{"$f":"IF(Input!F16=\"\",\"\",IF(F8=1,Input!F16*1.128,IF(F8=2,Input!F16*0.9,IF(F8=3,Input!F16*1.2,IF(F8=4,Input!F16,IF(F8=5,Input!F16,IF(F8=6,Input!F16*1.333,\"\")))))))","v":""},{"$f":"IF(G8=\"\",\"\",IF(AND(G8<25000,G8>0),1,IF(AND(G8>=25000,G8<50000),2,IF(AND(G8>=50000,G8<100000),3,IF(AND(G8>=100000,G8<150000),4,IF(AND(G8>=150000,G8<300000),5,6))))))","v":""},{"$f":"(IF(OR(E8=\"\",H8=\"\"),\"\",(E8+H8)))","v":""},{"$f":"IF(OR(E8=\"\",H8=\"\"),\"\",IF(I8<5,0,IF(AND(I8=5,E8=1),0,IF(AND(I8=5,E8>1),1,IF(AND(I8=6,E8=1),1,IF(AND(I8=6,E8>1),2,IF(I8>6,2,\"\")))))))","v":""},null,null,{"$f":"J8","v":""},null,{"$f":"IF(J8=\"\",\"\",J8=2)","v":""},{"$f":"IF(J8=\"\",\"\",J8=0)","v":""},{"$f":"IF(J8=\"\",\"\",J8=1)","v":""},{"$f":"IF(AND(H8=\"\",L8=\"\"),\"\",IF(O8=TRUE,2,(IF(Q8=TRUE,1,0))))","v":""}]
{"$rows_left_out":50}
{"sheet":"factsheet Oil-Char-Acetic Acid","index":12,"n_rows":30,"n_cols":3,"rows_kept":30,"cut":false,"hidden":false,"merged":[[47,7,47,8],[42,7,42,8],[45,7,45,8],[46,7,46,8],[43,6,44,6],[43,7,44,8],[36,7,36,8],[37,7,37,8],[38,7,38,8],[40,6,40,8],[41,7,41,8],[31,6,31,8],[32,7,32,8],[33,7,33,8],[34,7,34,8],[35,7,35,8],[31,1,31,2],[8,1,8,3],[13,1,13,3],[17,1,17,3],[21,1,21,3],[16,1,16,2],[20,1,20,2],[26,1,26,2],[27,1,27,2]]}
[null,"PYROLYSIS OF CELLULOSE TO PRODUCE OIL, (BIO)CHAR AND ACETIC ACID"]
[]
[null,"Possible effects on other processes of sewage treatment plant"]
[]
[null,null,"implementation of pyrolysis of cellulose has no impact on this process"]
[null,null,"implementation of pyrolysis of cellulose POSSIBLY has an effect on this process"]
[null,null,"implementation of pyrolysis of cellulose has an effect on this process"]
[]
{"$rows_left_out":23}
{"sheet":"Decision rules","index":13,"n_rows":10,"n_cols":8,"rows_kept":10,"cut":false,"hidden":false,"merged":[]}
[null,"Which decision rules are used in the DST?"]
[]
[null,"PHA",null,null,"Lipids for biodiesel",null,null,"Oil - Char - Acetic Acid"]
[null,"1. The sewage treatment plant should have a primary treatment (YES)",null,null,"1. Primary treatment (yes/no) and percentage sewage from households are not relevant for lipids for Bio-diesel.",null,null,"1. Primary treatment (yes/no), BOD/COD and COD are not relevant for oil, char and acetic acid."]
[null,"2. Amount of population equivalents (PE): criterium differs per country because the calculation of the PE is different.",null,null,"2. Amount of population equivalents (PE): criterium differs per country because the calculation of the PE is different.",null,null,"2. Percentage sewage from households"]
[null,"BELGIUM\nPE < 45000 = input stream of STP is probably NOT suitable for this technique\n45000 < PE < 90000 = it is not yet clear if input stream of STP is suitable for this technique\nPE > 90000 = input stream of STP  is promising for this technique\n\nFRANCE\nPE < 36000 = input stream of STP is probably NOT suitable for this technique\n36000 < PE < 72000 = it is not yet clear if input stream of STP is suitable for this technique\nPE > 72000 = input stream of STP  is promising for this technique\n\nGERMANY\nPE < 48000 = input stream of STP is probably NOT suitable for this technique\n48000 < PE < 96000 = it is not yet clear if input stream of STP is suitable for this technique\nPE > 96000 = input stream of STP  is promising for this technique\n\nLUXEMBOURG & NETHERLANDS\nPE < 40000 = input stream of STP is probably NOT suitable for this technique\n40000 < PE < 80000 = it is not yet clear if input stream of STP is suitable for this technique\nPE > 80000 = input stream of STP  is promising for this technique\n\nUNITED KINGDOM\nPE < 53000 = input stream of STP is probably NOT suitable for this technique\n53000 < PE < 107000 = it is not yet clear if input stream of STP is suitable for this technique\nPE > 107000 = input stream of STP  is promising for this technique",null,null,"BELGIUM\nPE < 22500 = input stream of STP is probably NOT suitable for this technique\n22500 < PE < 56400 = it is not yet clear if input stream of STP is suitable for this technique\nPE > 56400 = input stream of STP  is promising for this technique\n\nFRANCE\nPE < 18000 = input stream of STP is probably NOT suitable for this technique\n18000 < PE < 45000 = it is not yet clear if input stream of STP is suitable for this technique\nPE > 45000 = input stream of STP  is promising for this technique\n\nGERMANY\nPE < 24000 = input stream of STP is probably NOT suitable for this technique\n24000 < PE < 60000 = it is not yet clear if input stream of STP is suitable for this technique\nPE > 60000 = input stream of STP  is promising for this technique\n\nLUXEMBOURG & NETHERLANDS\nPE < 20000 = input stream of STP is probably NOT suitable for this technique\n20000 < PE < 50000 = it is not yet clear if input stream of STP is suitable for this technique\nPE > 50000 = input stream of STP  is promising for this technique\n\nUNITED KINGDOM\nPE < 26650 = input stream of STP is probably NOT suitable for this technique\n26650 < PE < 66650 = it is not yet clear if input stream of STP is suitable for this technique\nPE > 66650 = input stream of STP  is promising for this technique",null,null,"The input stream of STP is probably NOT suitable for this technique if:\n- % sewage water from households < 25% and PE < 40,000\n- % sewage water from households 25 - 50% and PE < 25,000\n\nIt is not yet clear if input stream of STP is suitable for this technique if:\n- % sewage water from households < 25% and PE > 40,000\n- % sewage water from households 25 - 50% and PE > 25,000\n- % sewage water from households >50% and PE < 40,000\n\nThe input stream of STP  is promising for this technique if:\n- % sewage water from households > 50% and PE > 40,000"]
[null,"3. BOD/COD ratio:",null,null,"3. BOD/COD ratio:",null,null,"3. Amount of population equivalents (PE): criterium differs per country because the calculation of the PE is different."]
[null,"BOD/COD-ratio < 0,2 = input stream of STP is probably NOT suitable for this technique\n0,2 < BOD/COD-ratio < 0,4 = it is not yet clear if input stream of STP is suitable for this technique\nBOD/COD-ratio >0,4 = input stream of STP  is promising for this technique\n\nIf the default value is used for the BOD/COD ratio (see manual and/or input tab for explanation), the value / number is  red and bold. This means that the shown result of the cell (green/yellow/orange) is NOT based on actual measuring data but on a default value.",null,null,"BOD/COD-ratio < 0,2 = input stream of STP is probably NOT suitable for this technique\n0,2 < BOD/COD-ratio < 0,4 = it is not yet clear if input stream of STP is suitable for this technique\nBOD/COD-ratio >0,4 = input stream of STP  is promising for this technique\n\nIf the default value is used for the BOD/COD ratio (see manual and/or input tab for explanation), the value / number is  red and bold. This means that the shown result of the cell (green/yellow/orange) is NOT based on actual measuring data but on a default value.",null,null,"The input stream of STP is probably NOT suitable for this technique if:\n- % sewage water from households < 25% and PE < 40,000\n- % sewage water from households 25 - 50% and PE < 25,000\n\nIt is not yet clear if input stream of STP is suitable for this technique if:\n- % sewage water from households < 25% and PE > 40,000\n- % sewage water from households 25 - 50% and PE > 25,000\n- % sewage water from households >50% and PE < 40,000\n\nThe input stream of STP  is promising for this technique if:\n- % sewage water from households > 50% and PE > 40,000"]
{"$rows_left_out":3}
{"sheet":" lists & calculation ","index":14,"n_rows":28,"n_cols":17,"rows_kept":28,"cut":false,"hidden":true,"merged":[]}
[null,"households",null,"primary treatment",null,null,"PE"]
[null,"<25%",null,"Yes"]
[null,"25-50%",null,"No",null,null,"Belgium (COD 135 g/day, BOD 60 g/day, 150 liter per person per day)"]
[null,">50%",null,null,null,null,"France (COD 135 g/day, BOD 60 g/day, 120 liter per person per day)",null,null,null,null,null,null,null,"=IF(Input!D3=' lists & calculation '!G3;1;IF(Input!D3=' lists & calculation '!G4;2;IF(Input!D3=' lists & calculation '!G5;3;IF(Input!D3=' lists & calculation '!G6;4;IF(Input!D3=' lists & calculation '!G7;5;\"\")))))"]
[null,null,null,null,null,null,"Germany (COD 120 g/day, BOD 60 g/day, 180 liter per person per day)"]
[null,null,null,null,null,null,"Luxembourg (COD 120 g/day, BOD 60 g/day, 150 liter per person per day)"]
[null,null,null,null,null,null,"Netherlands (COD 120 g/day, BOD 54 g/day, 150 liter per person per day)"]
[null,null,null,null,null,null,"United Kingdom (COD 120 g/day, BOD 60 g/day, 200 liter per person per day)"]
{"$rows_left_out":20}